program: Gaussian 09
title: 000287370
version: EM64L-G09RevD.01
frameworkgroup: C1[X(C8H9NO4S)]
method: RPBEPBE
basis: SDD
operation: Freq
keyword: #p
keyword: freq=noraman
keyword: PBEPBE/SDD
title: #p freq=noraman PBEPBE/SDD
converged: NO YES NO NO
title: Mulliken charges:
elementType: S O O O O N C C C C C C C C H H H H H H H H H
charge: 0.956284 -0.548877 -0.548869 -0.203334 -0.203337 0.027995 -0.790298 0.525368 -0.313373 -0.313456 -0.737905 -0.344861 -0.344853 0.377429 0.274154 0.274144 0.253139 0.253107 0.263940 0.263938 0.300292 0.289687 0.289686
chargesum: 0.00000
title: Mulliken charges with hydrogens summed into heavy atoms:
elementType: S O O O O N C C C C C C C C
charge: 0.956284 -0.548877 -0.548869 -0.203334 -0.203337 0.027995 -0.242001 0.525368 -0.060234 -0.060349 0.090266 -0.055175 -0.055166 0.377429
polarizability: 2.34343461e+02 9.27636598e-04 1.32534268e+02 -1.05371263e+01 5.75062151e-03 8.34930528e+01
1716.lowfreq: -18.1234 -7.4082 -5.9048 -0.0019 -0.0018 -0.0015 19.8482 27.9620 41.6780
frequency: 17.9009 27.1897 41.6768 64.0807 112.4815 137.7721 153.7417 172.0039 224.0693 241.7639 249.6569 314.7369 338.3379 350.4082 383.1161 405.9965 435.0681 506.0700 529.9441 566.0230 620.7792 626.5478 666.2267 740.2769 763.5689 792.1827 825.6004 842.5123 862.2842 865.0669 901.7028 962.6586 985.1201 991.2052 1000.2089 1005.0327 1091.1728 1091.2889 1132.8127 1179.5872 1189.4845 1220.7472 1234.1250 1295.8921 1303.8666 1370.7111 1405.9914 1406.9311 1421.6525 1425.5764 1428.0365 1481.3588 1593.1493 1608.2152 3027.0852 3059.5300 3151.6425 3155.3691 3157.1988 3177.5827 3179.4607 3186.9062 3189.3558
redmass: 5.7113 6.2482 8.0094 6.7380 7.7918 1.0645 4.0752 8.1119 4.6266 7.6357 4.0583 9.1792 7.4985 2.4348 6.7857 2.8366 6.1410 6.8932 3.7345 7.5390 6.7821 6.7543 4.1122 4.7307 7.5104 11.1502 5.3566 1.2547 2.5099 1.7133 1.5991 1.3301 1.3504 1.3820 1.8102 3.0183 1.3058 3.3272 1.1450 1.2594 1.2891 4.8814 3.0279 1.1384 1.2881 7.9350 8.6397 1.0565 2.5240 1.1923 1.1602 2.4938 7.6435 6.2287 1.0246 1.0563 1.1109 1.0921 1.0910 1.1069 1.1081 1.0949 1.0962
irintensity: 0.4378 3.9944 2.2311 0.0600 10.9678 0.1700 0.3437 0.2678 0.4334 3.2767 1.9652 21.6653 25.6718 0.1492 1.9920 0.0241 30.8059 0.8081 13.9330 46.0084 14.3547 0.1531 33.3973 4.9431 21.8244 34.2715 11.5710 0.4547 20.4167 43.9309 7.1066 52.6312 3.0025 0.5091 39.9063 3.9016 26.9082 19.1700 2.8692 22.5858 54.6190 312.7765 2.0621 1.3770 0.0288 96.0622 1.6424 9.7660 71.0578 0.4059 7.6773 2.4876 0.9300 26.3579 1.4545 10.6865 0.0083 3.8057 2.1182 0.4805 1.5525 0.2285 4.1817
temp: 298.150 k
press: 1.00000 atm
elementType: 16 8 8 8 8 7 6 6 6 6 6 6 6 6 1 1 1 1 1 1 1 1 1
symmnumber: 1
zpe: 424002.9 jmol-1
zpe.correction: 0.161494 hartree
zpe.thermalcorrener: 0.175960 hartree
zpe.thermalcorrenthalpy: 0.176905 hartree
zpe.thermalcorrgfe: 0.117358 hartree
zpe.sumelectzpe: -1062.673485 hartree
zpe.sumelectthermal: -1062.659018 hartree
zpe.sumelectthermalent: -1062.658074 hartree
zpe.sumelectthermalfe: -1062.717620 hartree
dipole: -6.5892 -0.0025 6.0881
dipole: 8.9712
quadrupole: -95.4392 -90.9097 -92.4869
quadrupole: 0.0018 -8.9462 -0.0014
quadrupole: -2.4939 2.0356 0.4584 0.0018 -8.9462 -0.0014
hfenergy: -1062.8349787 hartree
pointgroup: C01 [X(C8H9N1O4S1)]
dipole: -2.6090914 -0.0007773 2.3770502 debye
dipolederiv: 1.4144133 -0.0000141 0.0147855 -0.0000938 1.1222662 0.0000034 0.4498056 0.0000047 1.2601555 -0.6035133 0.0372703 -0.0145059 0.076242 -0.6054571 0.1610001 -0.1863813 0.0344381 -0.5658579 -0.6034617 -0.0372504 -0.0145225 -0.0762153 -0.6053359 -0.1610544 -0.1864664 -0.0345003 -0.5659861 -0.7746404 -0.190849 0.0983598 -0.2574029 -0.6575405 0.0307224 0.1545301 0.0501449 -0.2510281 -0.7747559 0.1908488 0.098374 0.2573721 -0.6574537 -0.0307116 0.1545551 -0.0501306 -0.2510327 1.9470353 0.0000571 -0.3108521 0.000115 1.0863456 -0.0000265 -0.505378 -0.00003 0.2730079 0.0555362 0.0000283 -0.0326854 0.0000818 0.0035572 0.0000145 -0.0808252 0.0000284 -0.0823054 0.3085301 -0.000044 0.0727177 0.0000633 0.0572046 0.0000498 -0.1878352 0.0000544 -0.1376491 -0.2034073 -0.2038647 -0.0318494 -0.144492 0.0239952 0.0307315 0.1062786 0.022723 -0.0883764 -0.2035731 0.2038316 -0.031857 0.1443704 0.0241327 -0.0307478 0.1062196 -0.0227741 -0.0883815 -0.3332789 0.0000016 0.0258874 0.0000396 -0.0807663 0.0000136 -0.0774049 0.0000037 -0.1496962 0.145 0.1662884 -0.0325261 -0.1357439 -0.0478869 0.035131 -0.0647379 -0.0636973 -0.0711942 0.1450414 -0.1662653 -0.0325238 0.1358275 -0.0479203 -0.0351349 -0.0647153 0.0636708 -0.0711868 -0.7862708 -0.0000673 0.0951258 -0.0001388 0.0910696 0.0000144 0.2325702 0.0000213 0.0341276 -0.0101761 0.0095303 -0.0111162 0.0766886 0.0009298 -0.0597868 -0.0114607 -0.029063 0.020459 -0.0101274 -0.0095053 -0.0111545 -0.0766895 0.0008685 0.0597855 -0.0115154 0.0290692 0.0204935 0.0393832 0.0775639 0.0387086 0.0672466 0.01243 -0.0158234 0.0169441 -0.0054932 0.1184759 0.0393973 -0.0775718 0.0387027 -0.0672549 0.0123492 0.0158278 0.0169451 0.005536 0.1184776 0.0140205 0.0014907 0.0299893 0.0111568 0.006288 0.0725321 0.0428989 0.068094 0.056818 0.0140212 -0.0015121 0.0299831 -0.0111878 0.0063785 -0.072568 0.0428835 -0.0681304 0.0567251 -0.023479 0.0000148 -0.0417688 0.0000071 0.119188 0.0000295 0.0066942 0.0000306 0.0332519 0.1021627 -0.0528629 0.0113611 -0.0219119 0.06767 0.0074162 0.0232 0.0170335 0.1653513 0.1021428 0.052881 0.0113666 0.0219199 0.0676878 -0.0074181 0.0231954 -0.0170338 0.1653513 unknown
polarizability: 234.4834776|0.0014582|132.5342683|-9.4810273|0.00024|83.3530357 unknown
InChI: InChI=1S/C8H9NO4S/c1-14(12,13)6-7-2-4-8(5-3-7)9(10)11/h2-5H,6H2,1H3
charge 0 multiplicity 1
23 atoms
S  -3.145878 0.000016 -0.459002
O  -2.87838 1.430287 -1.205458
O  -2.878537 -1.429768 -1.206432
O  4.096074 1.140484 -0.494005
O  4.096363 -1.139962 -0.494042
N  3.514014 0.000185 -0.331725
C  -2.043697 -0.000538 1.237042
C  -0.610404 -0.000362 0.851951
C  0.074456 1.228462 0.63913
C  0.074763 -1.2290 0.63906
C  -4.96502 -0.000092 0.162517
C  1.42538 1.236507 0.249719
C  1.425693 -1.236687 0.249659
C  2.083414 -0.000003 0.067102
H  -2.394197 0.915776 1.734218
H  -2.394128 -0.917173 1.733669
H  -0.458518 2.175622 0.770271
H  -0.457962 -2.176306 0.770173
H  -5.107286 -0.918803 0.748441
H  -5.107195 0.918252 0.749037
H  -5.570013 0.000234 -0.75498
H  1.973053 2.167006 0.081221
H  1.973605 -2.167039 0.08113
