program: Gaussian 09
title: 000287359
version: EM64L-G09RevD.01
frameworkgroup: C1[X(C8HCl4NO3)]
method: RPBEPBE
basis: SDD
operation: Freq
keyword: #p
keyword: freq=noraman
keyword: PBEPBE/SDD
title: #p freq=noraman PBEPBE/SDD
converged: YES YES NO YES
title: Mulliken charges:
elementType: Cl Cl Cl Cl O O O N C C C C C C C C H
charge: 0.090310 0.090310 0.084242 0.084243 -0.330108 -0.151629 -0.151623 -0.184007 0.375706 0.375708 0.143794 0.143787 -0.372519 -0.372518 -0.105233 -0.105233 0.384770
chargesum: 0.00000
title: Mulliken charges with hydrogens summed into heavy atoms:
elementType: Cl Cl Cl Cl O O O N C C C C C C C C
charge: 0.090310 0.090310 0.084242 0.084243 0.054662 -0.151629 -0.151623 -0.184007 0.375706 0.375708 0.143794 0.143787 -0.372519 -0.372518 -0.105233 -0.105233
polarizability: 2.04652978e+02 -2.41459489e-05 1.96149662e+02 1.88371992e+00 2.76673795e-04 5.25086190e+01
1716.lowfreq: 0.0004 0.0012 0.0014 4.2034 4.3137 5.7089 56.2557 63.0908 83.1998
frequency: 56.2546 63.0900 83.1994 102.7844 139.5329 156.1593 167.4997 194.5560 201.2033 202.9382 215.9306 281.1422 281.2407 305.0278 313.2485 324.0295 338.4378 360.6692 377.7578 531.5000 574.4316 589.2186 594.6227 648.7047 686.9007 716.7348 718.6623 758.7940 804.1249 828.4853 909.7390 987.3353 1083.7972 1116.0000 1187.4548 1228.1052 1327.2499 1347.5927 1384.2755 1390.0030 1559.2281 1571.8883 1655.9709 1694.1752 3470.0974
redmass: 20.7709 19.5880 25.8086 9.9141 14.4496 16.5647 1.0517 23.2615 8.9263 28.1093 34.7467 19.7896 15.8490 11.9262 20.1640 26.3404 12.5077 23.3295 13.2016 11.9760 13.8078 12.9476 12.0893 13.8072 13.6932 12.0924 11.8526 12.2000 11.9868 12.9590 12.3517 12.0182 13.6771 12.1910 7.9956 3.5614 10.7423 12.0322 2.9312 2.6792 11.9492 12.0074 12.9629 12.7839 1.0686
irintensity: 0.1925 0.2671 0.2368 3.2058 3.5595 0.0582 99.5111 0.4986 2.1205 0.3373 0.0001 0.6930 3.8710 4.9461 0.0015 0.0332 0.0029 0.1126 16.6878 0.1408 0.0277 0.6021 4.3292 36.8559 108.6333 12.7783 0.0091 7.2134 0.5074 1.8048 1.2602 116.5715 54.9005 28.2180 176.0372 68.3678 17.5072 186.3206 139.8955 14.3654 0.0611 8.9842 431.3432 83.6515 44.1756
temp: 298.150 k
press: 1.00000 atm
elementType: 17 17 17 17 8 8 8 7 6 6 6 6 6 6 6 6 1
symmnumber: 1
zpe: 200552.7 jmol-1
zpe.correction: 0.076386 hartree
zpe.thermalcorrener: 0.091256 hartree
zpe.thermalcorrenthalpy: 0.092200 hartree
zpe.thermalcorrgfe: 0.033191 hartree
zpe.sumelectzpe: -2424.930107 hartree
zpe.sumelectthermal: -2424.915238 hartree
zpe.sumelectthermalent: -2424.914293 hartree
zpe.sumelectthermalfe: -2424.973302 hartree
dipole: -1.1884 0.0000 1.7183
dipole: 2.0892
quadrupole: -115.0489 -129.7704 -114.2720
quadrupole: 0.0002 8.8670 -0.0003
quadrupole: 4.6482 -10.0733 5.4251 0.0002 8.8670 -0.0003
hfenergy: -2425.0064931 hartree
pointgroup: C01 [X(C8H1Cl4N1O3)]
dipole: 0.4763339 -0.0000258 -0.6698565 debye
dipolederiv: 0.0116855 -0.0224 -0.0010401 -0.1134897 -0.6533172 -0.0011501 0.0010268 0.0058192 0.0308033 0.0117109 0.0222755 -0.0010407 0.1133644 -0.6533419 0.0011301 0.0010239 -0.0058581 0.0308029 -0.5471819 -0.3179244 -0.0114604 -0.3219228 -0.1553604 -0.0066296 -0.0089625 -0.0050666 0.0287533 -0.5470632 0.3179982 -0.0114531 0.3219971 -0.1554805 0.0066289 -0.0089509 0.0050711 0.0287539 -0.6758386 0.0000355 -0.0326186 0.0000322 -0.3286054 -0.0000196 0.0016583 -0.000012 0.1050479 -0.5933457 0.2882303 -0.0042351 0.2619792 -0.8936334 -0.0177556 -0.0105969 -0.0026094 -0.2935268 -0.5934444 -0.2882862 -0.0042558 -0.2620342 -0.8935262 0.0176929 -0.0105747 0.0026662 -0.2935223 -0.0777784 -0.0000951 -0.0498256 -0.0000922 -1.059777 0.0000103 -0.1207964 -0.0000278 -0.2249353 -0.584707 0.1233784 -0.0140287 0.2770698 -0.2573595 0.0049978 -0.0023508 0.0156265 0.0403553 -0.5847682 -0.1233175 -0.0140213 -0.2770129 -0.2572864 -0.0049992 -0.0023847 -0.015614 0.0403586 1.2837911 0.0467709 0.0539522 -0.0768574 1.4106789 0.0501374 0.0641624 0.0391938 0.2624351 1.2837817 -0.046746 0.0539427 0.0768832 1.410671 -0.0500827 0.0641452 -0.0392288 0.2624239 -0.1306382 -0.1376831 -0.0023151 0.1168487 1.1150859 -0.0013984 -0.0154553 -0.0129184 -0.0333277 -0.1306413 0.1379141 -0.0023087 -0.1166153 1.1150821 0.0014396 -0.0154579 0.0129701 -0.0333285 0.7645128 0.6307074 0.0144831 0.5805462 -0.0346919 0.0145571 0.0135393 0.014815 -0.0202718 0.7642882 -0.6308564 0.0144692 -0.5806935 -0.0344604 -0.0145687 0.0135256 -0.0148338 -0.0202718 0.3456367 -0.0000015 0.0117562 -0.0000029 0.3253221 0.00001 0.0364486 0.0000071 0.0894499 unknown
polarizability: 204.5778827|-0.000805|196.1496624|3.8688671|0.001029|52.5837146 unknown
InChI: InChI=1S/C8HCl4NO3/c9-3-1-2(4(10)6(12)5(3)11)8(15)13(16)7(1)14/h16H
charge 0 multiplicity 1
17 atoms
Cl 0.894547 3.224805 -0.00883
Cl 0.893944 -3.224937 -0.008921
Cl 3.672303 1.601205 0.050961
Cl 3.672002 -1.60186 0.050936
O  -3.898188 0.000375 0.120051
O  -2.191775 2.362923 -0.028725
O  -2.192222 -2.362474 -0.028723
N  -2.501844 0.000255 -0.119874
C  -0.309788 0.711478 -0.019777
C  -0.309921 -0.711385 -0.019801
C  -1.731664 1.205381 -0.046093
C  -1.731889 -1.205022 -0.046209
C  0.891085 1.431971 -0.002305
C  0.890817 -1.432103 -0.002329
C  2.116933 0.708903 0.021059
C  2.1168 -0.709266 0.021052
H  -4.33454 0.000451 -0.777572
