program: Gaussian 09
title: 000287358
version: EM64L-G09RevD.01
frameworkgroup: C1[X(C16H22)]
method: RPBEPBE
basis: SDD
operation: Freq
keyword: #p
keyword: freq=noraman
keyword: PBEPBE/SDD
title: #p freq=noraman PBEPBE/SDD
converged: YES YES NO YES
title: Mulliken charges:
elementType: C C C C C C C C C C C C C C C C H H H H H H H H H H H H H H H H H H H H H H
charge: -0.185409 -0.185406 -0.422508 -0.422657 -0.422506 -0.422661 -0.408606 -0.408343 -0.408610 -0.408345 -0.380426 -0.380426 0.138953 0.138951 -0.181411 -0.181401 0.226761 0.226760 0.212354 0.196944 0.197285 0.212000 0.212353 0.196944 0.197285 0.212000 0.221811 0.197608 0.197486 0.221328 0.221813 0.197608 0.197486 0.221329 0.185461 0.201368 0.185461 0.201367
chargesum: 0.00000
title: Mulliken charges with hydrogens summed into heavy atoms:
elementType: C C C C C C C C C C C C C C C C
charge: 0.041352 0.041355 -0.013210 -0.013372 -0.013209 -0.013377 0.010813 0.010471 0.010811 0.010470 0.006403 0.006402 0.138953 0.138951 -0.181411 -0.181401
polarizability: 2.70279860e+02 -2.02414517e-03 1.36905147e+02 1.00760597e+01 -6.96091201e-04 1.36714624e+02
1716.lowfreq: -5.1834 -0.0007 -0.0003 0.0006 3.5189 24.0479 27.3403 40.4342 45.6878
frequency: 24.0243 40.3054 42.1141 66.0732 73.7949 137.5740 165.4077 208.2758 213.8244 229.7705 255.3187 315.2974 338.5764 348.7707 376.7252 396.1141 407.2660 456.1494 462.4286 465.3803 487.7578 511.2129 535.8969 542.1129 630.5645 700.5171 762.5004 782.2850 782.2945 793.5849 818.7954 855.1214 857.5204 860.3857 863.6124 864.2645 930.4184 930.4916 933.3944 1003.3774 1003.8707 1040.0063 1040.0392 1048.5532 1053.5021 1085.5113 1085.5259 1095.5977 1106.6402 1106.7606 1121.8031 1146.5164 1146.7076 1217.0070 1224.0473 1231.7331 1247.1090 1247.1718 1265.8696 1272.6329 1274.6813 1274.7746 1299.7149 1322.0041 1325.3826 1325.6054 1339.9388 1339.9958 1345.0457 1346.3499 1347.0604 1349.3369 1353.3907 1364.1707 1456.1826 1456.2445 1460.8990 1461.2185 1463.3952 1463.4643 1470.2088 1470.7085 1476.9056 1477.4550 2160.4080 2289.9976 2954.9042 2954.9461 2961.7710 2961.8414 2973.3518 2973.3568 2977.4422 2977.5311 2978.5217 2978.6032 2982.1421 2982.6608 3027.5846 3027.9566 3033.5334 3033.5854 3040.3849 3040.6254 3045.6311 3045.7525 3051.0409 3051.3918
redmass: 3.7537 3.4855 3.4470 3.7093 3.5407 5.0091 3.8890 2.4238 2.7809 2.1642 2.4019 2.9919 5.4878 1.7458 1.9438 3.3040 3.1945 3.7597 3.9461 3.0495 3.0507 1.7792 4.9199 5.5891 2.6988 2.7190 3.5445 1.4890 1.4872 3.5506 2.2931 1.4669 1.7084 2.5158 2.4300 2.4856 1.3721 1.3732 2.3726 2.5612 2.4782 1.5727 1.5718 1.7782 1.8015 1.7340 1.7344 1.7848 1.0719 1.0717 1.7622 1.6189 1.6198 1.6559 1.3108 1.4563 1.4041 1.4044 1.2697 1.2411 1.2948 1.2960 1.5449 2.0650 1.3101 1.3452 1.4248 1.4239 1.4025 1.4578 1.4559 1.4265 1.4918 1.7999 1.0833 1.0833 1.0875 1.0900 1.0857 1.0857 1.0805 1.0825 1.0923 1.0927 11.8725 11.9191 1.0775 1.0774 1.0631 1.0632 1.0624 1.0623 1.0618 1.0619 1.0613 1.0613 1.0696 1.0696 1.0959 1.0958 1.0996 1.0996 1.1000 1.0997 1.1019 1.1018 1.1027 1.1027
irintensity: 0.5503 0.0841 1.3017 0.1592 0.1631 1.8239 1.6281 0.2037 0.2599 0.0132 0.3140 0.7694 0.7983 0.2697 1.5340 0.2023 0.2444 0.0966 0.5808 1.6276 2.1964 0.0317 1.3986 0.1778 6.0860 0.1115 0.0596 0.0750 0.5023 0.2523 2.2928 5.7572 9.5550 9.0334 9.9734 0.0045 2.1174 12.7556 6.0132 1.1013 30.0418 0.0376 0.0517 0.2895 0.8022 0.0380 0.2439 0.1748 0.0116 0.0002 0.2444 0.8521 0.1697 0.9233 0.2374 0.0007 0.2440 0.0652 4.7451 0.1183 4.4564 0.7952 21.7721 0.0311 0.1779 0.0076 0.0076 0.2228 31.8517 0.7423 9.7536 0.4957 7.2937 0.1003 1.9735 8.2066 3.3876 10.5628 1.8823 18.9556 26.5636 6.9558 4.7579 5.0662 4.4188 1.9252 11.2997 5.1806 62.1892 23.1270 3.2323 18.6545 42.4403 42.6059 15.4813 74.5509 114.1279 45.0990 28.3417 95.1343 19.8365 121.1436 63.3256 4.0123 4.5708 26.7863 232.8397 1.4465
temp: 298.150 k
press: 1.00000 atm
elementType: 6 6 6 6 6 6 6 6 6 6 6 6 6 6 6 6 1 1 1 1 1 1 1 1 1 1 1 1 1 1 1 1 1 1 1 1 1 1
symmnumber: 1
zpe: 879404.8 jmol-1
zpe.correction: 0.334948 hartree
zpe.thermalcorrener: 0.350829 hartree
zpe.thermalcorrenthalpy: 0.351773 hartree
zpe.thermalcorrgfe: 0.290185 hartree
zpe.sumelectzpe: -621.587535 hartree
zpe.sumelectthermal: -621.571653 hartree
zpe.sumelectthermalent: -621.570709 hartree
zpe.sumelectthermalfe: -621.632297 hartree
dipole: 0.0000 0.4970 -0.0002
dipole: 0.4970
quadrupole: -80.2143 -98.4694 -97.3754
quadrupole: -0.0005 2.1845 0.0002
quadrupole: 11.8054 -6.4497 -5.3557 -0.0005 2.1845 0.0002
hfenergy: -621.9224825 hartree
pointgroup: C01 [X(C16H22)]
dipole: 0. 0.19553 -0.0001521 debye
polarizability: 270.3224531|0.0012969|136.9051471|9.7895953|-0.0007314|136.6720306 unknown
InChI: InChI=1S/C16H22/c1-3-9-15(10-4-1)13-7-8-14-16-11-5-2-6-12-16/h15-16H,1-6,9-12H2
charge 0 multiplicity 1
38 atoms
C  -3.366672 -1.002663 -0.51472
C  3.366779 -1.002508 0.515107
C  -4.150424 -0.851452 0.830377
C  -3.797321 0.128621 -1.504708
C  4.150309 -0.851644 -0.83016
C  3.797586 0.129047 1.504716
C  -3.9645 0.553199 1.448653
C  -3.611461 1.533181 -0.886536
C  3.964235 0.552832 -1.448785
C  3.611583 1.533438 0.886206
C  -4.374788 1.666505 0.454177
C  4.374659 1.666426 -0.454685
C  -1.907587 -1.004455 -0.293539
C  1.90766 -1.004339 0.294153
C  -0.678793 -1.009497 -0.105133
C  0.678848 -1.009398 0.105863
H  -3.639515 -1.980092 -0.965889
H  3.639696 -1.979814 0.966497
H  -3.826964 -1.634583 1.540985
H  -5.225411 -1.022454 0.615988
H  -4.867463 -0.02822 -1.751495
H  -3.224279 0.039723 -2.446258
H  3.826754 -1.634978 -1.5405
H  5.225337 -1.022558 -0.615903
H  4.867776 -0.027707 1.751352
H  3.224716 0.040391 2.446393
H  -2.901287 0.686071 1.731766
H  -4.558627 0.632145 2.379544
H  -3.95672 2.304131 -1.602308
H  -2.531346 1.712996 -0.714899
H  2.90097 0.685589 -1.731753
H  4.558199 0.63154 -2.379799
H  3.956958 2.304586 1.601708
H  2.531432 1.713185 0.714725
H  -5.466272 1.59944 0.261287
H  -4.189317 2.662785 0.900184
H  5.46618 1.599454 -0.261975
H  4.189069 2.662576 -0.900934
