program: Gaussian 09
title: 000287351
version: EM64L-G09RevD.01
frameworkgroup: C1[X(C7H12)]
method: RPBEPBE
basis: SDD
operation: Freq
keyword: #p
keyword: freq=noraman
keyword: PBEPBE/SDD
title: #p freq=noraman PBEPBE/SDD
converged: NO YES NO NO
title: Mulliken charges:
elementType: C C C C C C C H H H H H H H H H H H H
charge: 0.245387 -0.695597 -0.695711 -0.710924 -0.271702 0.145107 -0.622874 0.208313 0.224177 0.210989 0.224168 0.211086 0.208353 0.202981 0.218052 0.217925 0.223500 0.228375 0.228395
chargesum: 0.00000
title: Mulliken charges with hydrogens summed into heavy atoms:
elementType: C C C C C C C
charge: 0.245387 -0.052117 -0.052104 -0.071965 -0.048202 0.145107 -0.166105
polarizability: 1.09268586e+02 9.62319328e+00 6.38795537e+01 -3.27319013e-01 -8.42836608e-02 6.09401091e+01
1716.lowfreq: -19.0651 -6.3072 -0.0006 0.0003 0.0004 16.0052 45.1035 140.2670 184.0108
frequency: 44.1643 140.2540 184.0080 245.3520 253.8543 290.9800 298.0768 315.4270 370.4109 372.0390 387.9241 557.6428 613.0250 744.1424 870.9106 883.7036 887.3008 919.5809 930.9627 942.9922 999.7962 1019.4518 1024.4442 1095.5025 1192.8552 1208.6861 1265.4835 1317.7971 1370.7817 1373.8139 1400.0898 1439.9446 1453.5594 1463.2480 1463.7226 1476.0006 1477.0398 1493.3290 1997.5547 2968.3768 2971.0993 2979.5043 3057.4960 3062.5886 3067.5444 3072.6874 3074.1149 3076.0099 3080.9653 3082.3925 3164.3917
redmass: 2.5624 3.0712 1.0220 1.0342 1.0472 2.1522 2.6172 1.8955 2.7517 2.0388 2.4879 3.5825 1.8029 3.8350 1.3549 2.1865 1.1878 1.7237 1.5727 1.2024 1.4815 1.3956 1.4294 1.7340 2.1655 2.9308 3.0748 1.7386 1.1932 1.2047 1.2056 1.3512 1.0497 1.0472 1.0473 1.0532 1.0606 1.0679 9.9935 1.0346 1.0348 1.0354 1.0880 1.1001 1.0988 1.0603 1.1007 1.0993 1.0992 1.0991 1.1130
irintensity: 0.0680 0.6218 0.1328 0.0101 0.0564 0.1252 0.8668 9.4892 2.4392 0.4470 1.6667 2.8879 1.3623 0.7482 79.1061 21.8960 20.4700 2.9232 2.0656 0.0021 0.3062 0.1628 0.3956 9.6351 18.3739 11.6806 16.1965 2.8953 19.0462 21.5591 6.0256 4.2608 0.0055 0.2036 0.3823 13.1681 12.8228 20.6930 45.1690 32.0814 44.3250 21.0452 3.3811 0.4459 56.7386 6.3976 5.7392 40.9955 73.7675 52.9829 8.4819
temp: 298.150 k
press: 1.00000 atm
elementType: 6 6 6 6 6 6 6 1 1 1 1 1 1 1 1 1 1 1 1
symmnumber: 1
zpe: 433305.5 jmol-1
zpe.correction: 0.165037 hartree
zpe.thermalcorrener: 0.174195 hartree
zpe.thermalcorrenthalpy: 0.175139 hartree
zpe.thermalcorrgfe: 0.131842 hartree
zpe.sumelectzpe: -273.324086 hartree
zpe.sumelectthermal: -273.314929 hartree
zpe.sumelectthermalent: -273.313984 hartree
zpe.sumelectthermalfe: -273.357281 hartree
dipole: -0.5482 0.1001 -0.0122
dipole: 0.5574
quadrupole: -42.8034 -45.0605 -45.0394
quadrupole: 1.4431 -0.0526 0.0179
quadrupole: 1.4977 -0.7594 -0.7383 1.4431 -0.0526 0.0179
hfenergy: -273.4891231 hartree
pointgroup: C01 [X(C7H12)]
dipole: -0.2169894 -0.0306393 0.0078863 debye
dipolederiv: 0.2443148 -0.0150448 0.0001633 0.1611798 0.0982363 0.0021085 -0.0082397 0.0043441 0.1717828 -0.0521566 0.022357 -0.0506141 -0.0689765 0.059287 0.0180273 0.0128044 0.0155735 -0.0296901 -0.0520753 0.0268829 0.047889 -0.0710907 0.0546323 -0.0255904 -0.0047749 -0.0253603 -0.0269185 0.0087413 0.0359864 -0.0017723 0.0387429 -0.0783239 0.0052362 -0.0018964 0.0053833 0.031516 -0.1004551 0.107348 -0.0091493 0.1626205 0.0945457 -0.020714 -0.0158713 -0.0190279 -0.2570112 0.4651176 -0.2166017 0.0057349 -0.3306259 -0.040889 -0.0029498 0.0135043 -0.0043666 -0.1566936 -0.4228082 -0.0727957 0.010834 -0.0066669 -0.3925874 0.0323607 0.0062796 0.0330478 0.1628566 0.0931636 0.0308873 -0.0226137 0.0685018 -0.1816595 0.0508754 -0.0023326 -0.0054967 0.0698319 0.0467244 0.0387325 0.1146122 0.0408737 0.0688123 -0.0765493 0.0692283 -0.0490553 -0.1065528 -0.1773163 -0.0877347 -0.0291376 -0.1223592 0.0330201 0.0035119 -0.0159787 0.0263232 0.0715489 0.040402 0.0275555 -0.1228379 0.0351339 0.0798388 0.056133 -0.0777962 0.0286414 -0.1114216 -0.1756797 -0.0843037 0.0457258 -0.1191709 0.0312136 0.0044855 0.0372736 -0.0193227 0.072174 0.0940333 0.0332606 0.0185954 0.0666584 -0.1839628 -0.0263313 -0.0056445 0.0312127 0.071131 -0.1350929 -0.1452991 0.0111687 -0.1035202 0.0170261 0.0056166 0.0089914 0.0063158 0.0950735 0.0310316 0.0584614 -0.114024 0.0327467 0.0488921 0.0307026 -0.1075519 0.0641651 -0.0826159 0.0376768 0.0677258 0.1039312 0.0425924 0.0372819 -0.0447457 0.1000323 -0.0793733 -0.0780671 0.0164991 0.0507951 -0.0006006 0.0089968 -0.1057979 0.0140019 0.0023429 0.0125392 0.1588158 0.0203548 0.0639404 0.0533552 0.0869924 0.1769491 -0.0373409 0.0807067 -0.042792 -0.0262701 0.0175248 0.0578467 -0.0612599 0.0773709 0.1834851 0.0111619 -0.0910774 0.0172488 -0.0294898 unknown
polarizability: 108.4393795|-11.3863539|64.7089757|0.1180038|-0.07466|60.9398932 unknown
InChI: InChI=1S/C7H12/c1-5-6-7(2,3)4/h6H,1H2,2-4H3
charge 0 multiplicity 1
19 atoms
C  -0.900702 -0.026644 0.000917
C  -1.730977 0.302715 -1.273814
C  -1.689554 0.437508 1.259934
C  -0.64147 -1.549765 0.077344
C  0.41243 0.770924 -0.06285
C  1.646108 0.271601 -0.047941
C  2.882307 -0.223226 -0.032152
H  -1.92306 1.389179 -1.355746
H  -1.19712 -0.019761 -2.185907
H  -2.708234 -0.215326 -1.240481
H  -1.12649 0.210862 2.183191
H  -2.667605 -0.077343 1.312615
H  -1.879019 1.527181 1.233496
H  -1.600467 -2.098685 0.121052
H  -0.052338 -1.808604 0.975688
H  -0.08056 -1.902318 -0.8071
H  0.2911 1.865806 -0.117296
H  3.407819 -0.488069 -0.958697
H  3.427635 -0.378736 0.907648
