program: Gaussian 09
title: 000287348
version: EM64L-G09RevD.01
frameworkgroup: C1[X(C9H14O2)]
method: RPBEPBE
basis: SDD
operation: Freq
keyword: #pfreq=noraman
keyword: PBEPBE/SDD
title: #p freq=noraman PBEPBE/SDD
converged: NO YES NO YES
title: Mulliken charges:
elementType: O O C C C C C C C C C H H H H H H H H H H H H H H
charge: -0.432328 -0.255705 -0.108977 -0.434995 -0.434997 -0.395252 -0.395252 -0.386085 -0.108879 -0.357939 0.166542 0.212901 0.217818 0.196551 0.196553 0.217817 0.195226 0.203544 0.203546 0.195228 0.191995 0.203711 0.273822 0.260455 0.374699
chargesum: 0.00000
title: Mulliken charges with hydrogens summed into heavy atoms:
elementType: O O C C C C C C C C C
charge: -0.057628 -0.255705 0.103923 -0.020626 -0.020627 0.003519 0.003522 0.009621 0.164943 -0.097484 0.166542
polarizability: 1.51511293e+02 3.72951156e-03 7.88452186e+01 -4.29320415e+00 1.98425071e-03 8.87177799e+01
1716.lowfreq: -15.1946 -0.0006 -0.0005 0.0005 9.4422 20.7446 34.0184 74.2156 74.5699
frequency: 33.2826 74.1282 74.5202 153.8053 162.6327 224.5818 239.4982 309.4186 354.5527 386.4217 432.2164 439.9288 491.9045 534.1677 591.9404 618.6450 695.6844 781.7291 783.9755 840.6563 862.3515 868.8097 894.6277 924.4237 928.5761 957.8212 1004.7660 1043.2314 1046.5813 1048.3981 1067.4025 1107.0508 1109.3718 1156.0477 1172.2297 1201.2655 1246.1351 1252.6972 1256.0815 1278.0048 1299.6662 1300.0617 1320.5690 1332.5355 1333.4377 1341.7866 1345.9273 1359.8646 1458.6995 1461.4054 1461.7901 1468.5841 1477.1816 1639.8824 1658.4178 2962.9701 2965.3068 2968.3615 2968.8822 2969.1690 2976.0514 3028.8520 3030.1599 3036.2183 3037.2564 3047.0529 3078.6360 3152.3168 3520.5144
redmass: 4.5616 5.3725 3.7959 2.8725 3.7279 1.7607 4.7278 2.2469 2.4979 2.2076 2.9659 3.5133 2.0918 2.4258 1.2532 3.7211 3.9749 1.4606 2.4574 2.0388 2.2245 2.2065 1.3759 1.9919 3.8259 2.1124 1.1535 2.1647 1.4797 1.9349 1.2378 2.1641 2.2757 2.4230 1.3866 1.3448 1.4330 1.2561 1.3008 1.3501 1.2228 1.3739 1.3431 1.5615 1.3625 1.4936 1.5247 1.6838 1.0877 1.0880 1.0879 1.0819 1.0936 8.5827 6.2973 1.0721 1.0634 1.0610 1.0590 1.0681 1.0731 1.0970 1.0958 1.0995 1.1026 1.1034 1.0899 1.0925 1.0640
irintensity: 0.6934 0.3017 0.2751 1.1959 0.5155 0.0305 1.5432 0.7792 1.5980 0.9830 0.0205 10.3736 9.4307 34.3878 113.3668 3.5234 54.2044 0.3756 0.5405 3.6651 14.6761 0.5199 1.7888 1.7210 22.7649 70.2691 43.1671 332.0646 0.6225 21.7630 0.0598 9.8155 0.0004 24.8701 0.9061 7.4522 1.1604 2.6672 0.9168 15.7531 0.5050 1.2366 0.4460 24.1441 0.3201 0.3781 18.0649 26.7056 1.8937 10.6226 10.6491 20.2757 4.0408 278.8913 134.6759 7.0520 27.3709 20.7829 37.3410 29.3375 45.7310 87.6074 70.7465 2.4584 6.0211 123.2760 9.1605 6.2500 38.4631
temp: 298.150 k
press: 1.00000 atm
elementType: 8 8 6 6 6 6 6 6 6 6 6 1 1 1 1 1 1 1 1 1 1 1 1 1 1
symmnumber: 1
zpe: 560158.1 jmol-1
zpe.correction: 0.213353 hartree
zpe.thermalcorrener: 0.224388 hartree
zpe.thermalcorrenthalpy: 0.225332 hartree
zpe.thermalcorrgfe: 0.175626 hartree
zpe.sumelectzpe: -500.941747 hartree
zpe.sumelectthermal: -500.930712 hartree
zpe.sumelectthermalent: -500.929768 hartree
zpe.sumelectthermalfe: -500.979475 hartree
dipole: -2.2510 -0.0001 -1.2048
dipole: 2.5531
quadrupole: -63.7150 -67.2298 -70.4998
quadrupole: 0.0019 -4.5212 -0.0006
quadrupole: 3.4332 -0.0816 -3.3516 0.0019 -4.5212 -0.0006
hfenergy: -501.1551003 hartree
pointgroup: C01 [X(C9H14O2)]
dipole: 0.8872486 -0.0000162 -0.4709029 debye
dipolederiv: -1.0795095 0.0000534 -0.5892164 -0.0002875 -0.4378248 -0.0003448 -0.5863857 -0.000018 -0.6921933 -0.8277943 0.000009 0.1777449 -0.0001991 -0.3351506 0.0003696 0.2693717 -0.0002173 -0.9429058 -0.3107823 0.0000164 0.0185429 -0.00015 0.0120447 0.0000105 -0.1040902 -0.0000184 0.1342649 -0.0181675 0.0091097 0.0136242 -0.1820343 0.1070966 0.0111498 0.1550375 -0.0271981 0.1522242 -0.0181841 -0.0090856 0.0136317 0.1821643 0.1070956 -0.0111602 0.1551328 0.0271773 0.1522233 0.048232 -0.0193705 0.0046465 0.0836484 0.0409661 -0.0131521 -0.0768594 0.020803 0.1519809 0.0482372 0.0193738 0.0046505 -0.0836997 0.0409671 0.0131433 -0.0769103 -0.0208067 0.1519821 0.0853373 -0.0000042 -0.0193156 -0.0000112 0.0374044 -0.0000028 0.0352876 -0.000008 0.1491044 0.8000245 -0.0001306 0.0196004 0.0000461 -0.1670666 -0.0000257 0.1123232 -0.0000132 0.1088442 -1.0994467 0.0000294 0.0052712 0.0002236 -0.1797766 -0.000058 -0.0915589 -0.000001 0.0473751 2.0967364 0.0000475 0.243432 0.0002718 0.2712652 -0.0000417 -0.0781015 0.0002058 1.2948845 0.0295594 0.000003 -0.010227 0.0000162 0.0251434 0.0000116 0.0132855 0.0000083 -0.1677317 -0.0092548 -0.110705 -0.0313231 -0.0784712 -0.1217239 -0.0405777 -0.0411738 -0.0712165 0.0526929 0.0483482 0.0237629 0.0184387 0.0168763 0.0648151 -0.0331104 0.0263953 0.0376225 -0.1714766 0.0483388 -0.0237614 0.0184438 -0.0168765 0.0648252 0.0331268 0.0263803 -0.037612 -0.1714752 -0.0092097 0.1106847 -0.0313032 0.0784502 -0.121787 0.0405672 -0.0411484 0.0712127 0.0527035 0.0335266 -0.0270353 -0.0122158 -0.0389691 0.0671503 0.0128951 0.0395691 -0.0496668 -0.1921822 -0.0743945 0.1104002 -0.0290169 0.1155708 -0.1463849 0.0504775 -0.0313773 0.0779014 0.0577559 -0.074468 -0.110422 -0.0290391 -0.1155729 -0.1463106 -0.0504904 -0.0313945 -0.0779106 0.0577436 0.0335421 0.0270454 -0.0122162 0.0389723 0.0671316 -0.0128661 0.0395885 0.0496831 -0.192177 0.093007 -0.0000099 0.018385 -0.0000064 0.0178948 0.0000074 -0.0597239 0.0000168 -0.1954217 -0.2423815 0.0000321 0.0555816 0.0000341 0.04008 -0.0000081 0.0951859 -0.0000127 0.0580529 0.0790031 0.0000105 -0.0007882 0.0000167 0.1353662 0.00001 0.0337777 0.0000059 -0.0500997 0.066374 0.0000179 0.0403374 0.0000782 0.1664749 0.0000124 0.0503015 0.0000248 -0.0513589 0.2533263 -0.0000717 0.1123307 -0.0000912 0.3903037 0.0000569 0.1670877 0.0000375 0.2051898 unknown
polarizability: 151.4806768|-0.000985|78.8452185|4.5114456|-0.0024317|88.7483957 unknown
InChI: InChI=1S/C9H14O2/c10-9(11)7-6-8-4-2-1-3-5-8/h6-8,10H,1-5H2
charge 0 multiplicity 1
25 atoms
O  -4.160669 0.000162 -0.937817
O  -3.457771 0.000065 1.282044
C  0.722256 0.000126 -0.275037
C  1.475583 -1.276781 0.210074
C  1.475918 1.276794 0.210194
C  2.953338 -1.274945 -0.248739
C  2.953674 1.274617 -0.248616
C  3.692389 -0.000284 0.221938
C  -0.696563 0.000282 0.230205
C  -1.816998 0.000539 -0.545618
C  -3.163916 0.000757 0.060256
H  0.717001 0.00018 -1.385124
H  0.955856 -2.17894 -0.164609
H  1.434093 -1.317162 1.318662
H  1.434435 1.317085 1.318785
H  0.956424 2.179122 -0.164408
H  2.992572 -1.331145 -1.356308
H  3.462967 -2.1794 0.13584
H  3.463539 2.1789 0.136052
H  2.992924 1.330914 -1.356179
H  3.751607 -0.000345 1.330123
H  4.733141 -0.000402 -0.155314
H  -0.833808 0.000212 1.324336
H  -1.769593 0.000616 -1.63974
H  -5.0520 -0.000269 -0.494698
