program: Gaussian 09
title: 000287341
version: EM64L-G09RevD.01
frameworkgroup: C1[X(C7H11Cl)]
method: RPBEPBE
basis: SDD
operation: Freq
keyword: #pfreq=noraman
keyword: PBEPBE/SDD
title: #p freq=noraman PBEPBE/SDD
converged: YES YES NO NO
title: Mulliken charges:
elementType: Cl C C C C C C C H H H H H H H H H H H
charge: -0.077772 -0.340946 -0.348531 -0.492090 -0.687145 0.081881 0.053269 -0.680486 0.203212 0.197138 0.191983 0.225766 0.233534 0.236440 0.220512 0.205432 0.210744 0.283548 0.283511
chargesum: 0.00000
title: Mulliken charges with hydrogens summed into heavy atoms:
elementType: Cl C C C C C C C
charge: -0.077772 0.059404 0.069218 -0.022116 -0.050457 0.081881 0.053269 -0.113427
polarizability: 1.13926587e+02 1.32335818e+01 8.04073413e+01 -4.04449150e+00 2.78721441e+00 6.18336833e+01
1716.lowfreq: -9.8989 -5.0347 0.0010 0.0015 0.0025 6.8827 14.6090 46.8360 71.9258
frequency: 11.3589 46.7899 71.8955 114.7941 141.0663 218.4546 238.6532 271.2392 284.4814 373.8557 418.9122 536.9179 618.9764 704.8126 753.0136 807.3072 877.1312 895.2433 925.4190 990.9553 1059.8549 1096.7590 1109.1041 1140.3398 1186.9222 1208.2934 1229.9771 1245.0470 1288.7031 1302.2679 1320.5423 1356.7969 1390.2723 1442.6177 1449.4786 1463.5631 1474.3413 1477.3648 1486.2378 2269.4597 2968.8123 2971.2982 2973.5215 2981.0186 3016.0345 3022.5316 3046.1787 3048.3940 3069.7320 3074.3885 3120.0086
redmass: 4.2421 3.4289 1.7004 4.1323 2.6749 1.1490 2.4628 2.9727 3.8515 3.3981 7.8855 3.2719 7.3978 2.2516 1.3297 1.8398 1.4305 1.4691 1.3935 2.6585 2.3984 1.5862 1.9616 1.0871 2.8990 1.3207 1.3309 1.2108 1.1399 1.2486 1.4402 1.5416 1.2123 1.1172 1.0856 1.0759 1.0551 1.0435 1.0820 11.6877 1.0584 1.0418 1.0558 1.0613 1.0979 1.0984 1.1032 1.0560 1.1014 1.0991 1.1098
irintensity: 1.4893 1.1053 0.5368 2.0593 5.6121 0.2665 3.9815 3.3287 4.7323 0.5405 15.2875 3.0163 67.3121 24.7986 3.6195 0.3112 5.7882 0.8642 10.2228 4.1364 0.4557 1.3789 0.8372 0.0234 12.3986 0.8980 0.0835 45.0344 0.9240 0.2567 12.9255 4.6287 11.6737 4.3598 13.5438 1.5529 3.5911 12.2367 14.7984 62.7459 10.1638 42.7144 9.6824 70.2635 7.3594 13.5994 20.4820 21.1358 96.2542 45.7998 3.6299
temp: 298.150 k
press: 1.00000 atm
elementType: 17 6 6 6 6 6 6 6 1 1 1 1 1 1 1 1 1 1 1
symmnumber: 1
zpe: 416247.4 jmol-1
zpe.correction: 0.158540 hartree
zpe.thermalcorrener: 0.168924 hartree
zpe.thermalcorrenthalpy: 0.169868 hartree
zpe.thermalcorrgfe: 0.119788 hartree
zpe.sumelectzpe: -732.709248 hartree
zpe.sumelectthermal: -732.698865 hartree
zpe.sumelectthermalent: -732.697921 hartree
zpe.sumelectthermalfe: -732.748001 hartree
dipole: 1.9205 2.0124 0.8113
dipole: 2.8976
quadrupole: -55.9262 -55.6983 -55.1514
quadrupole: -2.9889 -4.4524 -0.2229
quadrupole: -0.3342 -0.1063 0.4406 -2.9889 -4.4524 -0.2229
hfenergy: -732.8677884 hartree
pointgroup: C01 [X(C7H11Cl1)]
dipole: 0.6162718 0.7945984 0.5370837 debye
dipolederiv: -0.3678853 -0.1212894 -0.0434453 -0.392626 -0.524078 -0.1660187 -0.2738657 -0.2569329 -0.31141 0.1603169 0.0405105 -0.0169518 -0.0618465 0.050641 -0.0304584 0.0615222 0.0155473 0.1276291 0.0520987 0.0265133 -0.0507346 0.0297285 0.0540871 -0.0115859 -0.089953 -0.0244604 0.1204215 0.0671165 0.0223425 -0.0129951 0.0156516 0.0420277 0.006265 -0.0170506 0.0033801 0.1591414 0.0341729 0.0664402 -0.0320073 0.0991014 0.0023079 0.0151274 -0.0035767 0.0028225 0.0713195 0.2954641 0.1539517 -0.0238119 0.1943031 -0.0385983 0.0280867 -0.1213232 0.0002906 -0.0904197 -0.6911266 -0.2059091 -0.0456975 -0.1308669 -0.2818088 -0.0694914 0.1387414 0.0032972 -0.2039821 0.7244778 0.3167387 0.107924 0.5245652 0.7372941 0.2685857 0.2462386 0.3059178 0.4205633 0.0753037 0.0185927 0.0480874 0.0256387 0.0364527 0.0475327 0.0103039 0.008407 -0.1674263 -0.2009973 -0.1237201 -0.0137051 -0.0657831 -0.0205812 -0.0030129 0.0119323 0.0053407 0.0758227 0.0611169 0.0176842 0.0324428 0.0060019 0.0223245 0.0668533 0.0290529 0.0310212 -0.1923504 -0.1103459 -0.0880044 -0.0117579 -0.0978154 0.0011222 -0.0100437 0.0057276 0.004868 0.0703858 -0.0365625 -0.051708 0.0405549 -0.0196407 0.107797 0.0199275 0.0348188 0.0737571 -0.1022477 -0.0238482 -0.0188626 -0.0084487 0.004335 -0.1086072 -0.0675836 -0.0090294 -0.1033553 0.0751214 0.0625664 0.0333051 -0.005046 0.0848679 -0.1452193 -0.093611 0.0135177 -0.1172143 0.0379633 -0.1492951 -0.0695236 -0.0054383 -0.1410844 0.0220799 0.0144247 0.0001814 0.0251994 0.0827767 0.0604985 -0.0011277 0.0633214 0.0020622 0.0804594 0.0297319 0.0109209 0.0744658 -0.1709433 0.0442125 -0.0458521 0.0063865 -0.1037221 0.0037391 0.0001205 0.0260627 -0.0090617 -0.0722008 -0.057284 0.0299179 -0.0286775 0.0271298 -0.0414397 -0.0448497 -0.0742221 -0.0432898 0.0698357 unknown
polarizability: 110.6880498|16.0038314|81.8989563|3.9970663|7.7635483|63.5806056 unknown
InChI: InChI=1S/C7H11Cl/c1-2-3-4-5-6-7-8/h2-4,7H2,1H3
charge 0 multiplicity 1
19 atoms
Cl -3.285227 -1.456851 -1.068333
C  1.949406 0.70012 0.35359
C  2.072865 -0.664356 -0.359828
C  0.83521 1.610179 -0.24101
C  3.179531 -1.550895 0.250445
C  -0.521066 1.047682 -0.111276
C  -1.656076 0.570634 0.00089
C  -2.988171 0.015276 0.135526
H  1.750793 0.538251 1.431201
H  2.91233 1.244418 0.281185
H  2.280685 -0.495972 -1.436326
H  1.099767 -1.189913 -0.307405
H  1.045893 1.79649 -1.313886
H  0.859369 2.599749 0.257719
H  3.254115 -2.51932 -0.276792
H  4.167633 -1.056031 0.190415
H  2.97439 -1.762576 1.316951
H  -3.173864 -0.416871 1.130671
H  -3.778883 0.733885 -0.128041
