program: Gaussian 09
title: 000287330
version: EM64L-G09RevD.01
frameworkgroup: C1[X(C10H9BrN2O2)]
method: RPBEPBE
basis: SDD
operation: Freq
keyword: #p
keyword: freq=noraman
keyword: PBEPBE/SDD
title: #p freq=noraman PBEPBE/SDD
converged: NO YES NO NO
title: Mulliken charges:
elementType: Br O O N N C C C C C C C C C C H H H H H H H H H
charge: -0.032529 -0.240247 -0.178049 -0.014258 -0.437409 -0.654697 -0.457335 0.574339 0.237475 -0.403964 -0.318574 -0.219363 -0.240251 -0.231456 0.217870 0.327228 0.276402 0.264118 0.236654 0.229421 0.233664 0.232590 0.235311 0.363061
chargesum: 0.00000
title: Mulliken charges with hydrogens summed into heavy atoms:
elementType: Br O O N N C C C C C C C C C C
charge: -0.032529 -0.240247 -0.178049 -0.014258 -0.074347 -0.327469 0.083186 0.574339 0.237475 -0.167310 -0.089153 0.014300 -0.007661 0.003855 0.217870
polarizability: 1.99390280e+02 2.32524844e+01 1.04751809e+02 -5.52381286e+00 7.28723297e+00 1.19644926e+02
1716.lowfreq: -3.2105 -0.0008 -0.0007 -0.0006 6.0416 8.0621 23.2446 35.5217 42.1964
frequency: 23.2362 35.3337 42.1692 66.3642 82.1938 152.9906 182.4608 225.2603 237.4422 261.5527 323.2721 400.8796 405.0763 469.6882 516.4988 557.4526 574.5932 600.6468 616.8028 624.4506 674.1979 678.6916 700.0240 761.1635 779.3924 781.8894 833.0726 850.1278 910.4046 923.3022 931.4071 978.3277 989.9665 1000.2975 1012.7599 1028.5130 1058.2537 1095.2639 1130.0543 1151.5162 1175.5175 1192.7459 1203.9831 1214.1662 1249.1957 1286.9411 1333.8899 1364.5822 1386.0492 1396.7425 1439.4667 1446.6847 1485.2349 1571.8962 1592.1596 1611.7231 1776.4008 2979.7516 3073.2074 3096.4519 3124.9106 3129.4841 3140.9216 3152.9720 3168.5603 3646.2906
redmass: 10.9124 4.1680 6.5615 5.9909 9.5815 11.2902 5.9611 5.3079 7.1310 3.7818 3.9927 2.8306 4.8797 4.4011 5.2658 4.5303 4.4051 1.2464 6.1983 4.6521 8.4507 9.9393 1.6853 4.2276 4.0793 3.4224 4.6330 1.2556 4.0437 2.0395 1.6447 1.3948 6.0459 1.3378 4.1359 2.3310 2.7126 1.8981 5.8654 1.2676 1.0596 1.1308 1.4357 2.3797 1.3712 2.0306 1.3678 1.4066 4.3940 1.9210 1.2241 1.9224 2.3017 7.4226 5.9569 6.0101 11.3082 1.0671 1.0916 1.0876 1.0870 1.0868 1.0915 1.0963 1.1016 1.0825
irintensity: 1.2279 0.0764 1.6165 1.0751 0.7063 0.2980 0.5096 2.5837 0.4347 2.5889 3.7310 1.0414 12.6859 13.8830 9.7748 44.0988 13.8191 168.7934 2.0055 0.8628 3.8927 5.2337 56.0703 62.2632 97.8776 40.4593 8.2256 0.1140 11.8459 11.5228 8.6546 0.3202 1.5215 0.1142 9.4174 4.4707 8.9432 9.1804 26.3119 13.9456 0.2410 1.7240 8.7431 78.0145 17.9152 25.1871 19.6347 14.0492 7.2750 16.9615 20.1291 9.8027 3.4909 37.5141 0.6490 0.7440 658.9803 7.2706 0.5738 1.2182 4.6153 1.9080 11.5164 32.2251 20.1335 100.2825
temp: 298.150 k
press: 1.00000 atm
elementType: 35 8 8 7 7 6 6 6 6 6 6 6 6 6 6 1 1 1 1 1 1 1 1 1
symmnumber: 1
zpe: 460005.5 jmol-1
zpe.correction: 0.175207 hartree
zpe.thermalcorrener: 0.188562 hartree
zpe.thermalcorrenthalpy: 0.189506 hartree
zpe.thermalcorrgfe: 0.131653 hartree
zpe.sumelectzpe: -658.785530 hartree
zpe.sumelectthermal: -658.772175 hartree
zpe.sumelectthermalent: -658.771230 hartree
zpe.sumelectthermalfe: -658.829084 hartree
dipole: -3.9073 -1.9027 2.3610
dipole: 4.9459
quadrupole: -101.5287 -100.6097 -89.8252
quadrupole: 9.2231 12.9486 0.8517
quadrupole: -4.2075 -3.2885 7.4960 9.2231 12.9486 0.8517
hfenergy: -658.9607366 hartree
pointgroup: C01 [X(C10H9Br1N2O2)]
dipole: -1.4738062 1.1595774 -0.5192575 debye
dipolederiv: -0.3607709 0.1291622 0.0303483 0.3737695 -0.7034321 -0.2239395 0.0494005 -0.1407391 -0.1869866 -1.32839 0.0448247 -0.284785 -0.0022623 -0.1434243 0.0878517 0.2117012 0.0732416 -0.4525192 -1.4279498 0.0935402 -0.3801155 0.1618918 -0.3436535 0.0687378 -0.4788204 0.0540364 -0.544547 0.1428252 0.0346021 -0.1546201 -0.0694006 -0.1524305 0.0873068 0.1480169 0.0828549 -0.3879255 -0.6987278 -0.0691487 0.1055127 0.1397607 -0.3466465 0.0436845 -0.5608778 0.042147 -0.4844566 0.6799795 -0.2619693 -0.0425845 -0.3363323 0.9918578 0.3176943 0.0520621 0.2709966 0.1794292 -0.154726 0.0548253 -0.0127704 0.0882686 -0.0339863 -0.1040265 -0.0743519 -0.0340678 -0.03887 -0.194057 0.0152076 0.0159457 -0.1431427 -0.1074542 -0.028257 -0.0745595 -0.0208675 -0.0264699 0.8724577 0.0453342 0.1627025 -0.1251495 0.0979797 -0.1100964 0.1510325 -0.1175684 0.5242019 -0.0541051 0.0102872 -0.0972901 0.00737 -0.1314303 -0.0177832 0.0480997 -0.0914507 0.0429628 -0.0332965 -0.0559655 0.0634392 -0.0422652 -0.0939142 -0.0759136 0.0002652 -0.0062111 -0.001627 -0.0507397 -0.0532001 0.1116237 -0.0699965 -0.0730997 -0.0726954 0.120123 -0.0924233 0.0146988 -0.095904 0.0466466 -0.0890799 0.0240856 -0.1372026 -0.0552385 -0.144993 -0.0244987 0.0929247 0.0863784 -0.0393395 -0.0256876 -0.0525063 -0.1269537 -0.0271034 -0.0136602 -0.0412267 -0.0424385 2.1946045 -0.1634874 0.5744649 -0.1998548 0.3759682 -0.1803867 0.5413285 -0.1638904 0.9655718 0.09828 0.0236339 0.0032146 -0.0065353 -0.0834443 0.0204611 0.0235977 -0.0053798 -0.0001465 0.0761735 -0.0261674 0.0183486 -0.0266655 0.0687873 0.0806179 0.0106514 0.0554398 0.0296928 -0.0078945 -0.0153368 0.0139089 0.0453597 -0.0479247 -0.0612812 0.0204793 -0.0826913 0.0655783 0.0541689 -0.0155652 0.0962877 0.0029879 0.1272507 0.02902 0.0771792 0.0320572 -0.040331 0.0490981 0.0492199 -0.0922987 0.0770956 0.0924293 0.0630757 -0.0933252 0.0560716 0.0064927 0.0090952 0.0637308 -0.0703279 0.0625317 0.1172783 0.0749209 -0.0899254 0.0805894 -0.0148643 0.0393454 0.0084778 0.0743322 -0.0004859 0.1392374 0.0526033 0.096622 0.0426421 -0.0647216 -0.1089141 0.058369 0.0340114 0.0638941 0.1363672 0.0107393 0.0371222 0.0096001 0.0921612 0.213069 0.0223185 -0.0545807 0.0275817 0.3778411 0.020008 -0.057168 0.021338 0.2721893 unknown
polarizability: 198.3575457|-25.8019951|103.7065471|-2.4992922|-3.9818152|121.7229215 unknown
InChI: InChI=1S/C10H9BrN2O2/c11-8(7-4-2-1-3-5-7)6-9-12-13-10(14)15-9/h1-5,8,13H,6H2
charge 0 multiplicity 1
24 atoms
Br -0.184252 -2.376354 -0.826319
O  2.920816 -0.261085 1.298967
O  5.321003 -0.331108 1.12775
N  2.427967 0.293167 -0.869181
N  3.825817 0.181502 -0.689472
C  -0.448619 -0.350154 -0.412058
C  0.501017 0.015435 0.743564
C  -1.907387 -0.076084 -0.158843
C  1.93887 0.019267 0.332238
C  -2.702845 0.45093 -1.209559
C  -2.511804 -0.322776 1.102727
C  -4.070232 0.735257 -1.004242
C  -3.878284 -0.041037 1.308178
C  -4.662131 0.490267 0.256226
C  4.217038 -0.152962 0.60161
H  -0.105459 0.104947 -1.353538
H  0.383423 -0.674371 1.596248
H  0.223833 1.026443 1.107969
H  -2.247434 0.634627 -2.190356
H  -1.922233 -0.753126 1.920429
H  -4.671475 1.143835 -1.823585
H  -4.334448 -0.238993 2.28425
H  -5.723838 0.70706 0.41718
H  4.445258 0.321314 -1.482483
