program: Gaussian 09
title: 000287317
version: EM64L-G09RevD.01
frameworkgroup: C1[X(C9H6Cl2N2O2S2)]
method: RPBEPBE
basis: SDD
operation: Freq
keyword: #p
keyword: freq=noraman
keyword: PBEPBE/SDD
title: #p freq=noraman PBEPBE/SDD
converged: YES YES NO NO
title: Mulliken charges:
elementType: Cl Cl S S O O N N C C C C C C C C C H H H H H H
charge: 0.010048 0.023005 0.940057 0.376215 -0.537474 -0.513169 0.025626 -0.075290 -0.374263 0.533001 -0.317993 -0.717756 -0.323247 -0.356178 -0.074716 -0.191208 -0.112173 0.299770 0.274964 0.287251 0.262634 0.292113 0.268781
chargesum: 0.00000
title: Mulliken charges with hydrogens summed into heavy atoms:
elementType: Cl Cl S S O O N N C C C C C C C C C
charge: 0.010048 0.023005 0.940057 0.376215 -0.537474 -0.513169 0.025626 -0.075290 -0.374263 0.533001 -0.317993 0.144228 -0.060612 -0.064065 -0.074716 0.077573 -0.112173
polarizability: 3.45547465e+02 -2.30566177e+00 1.73822372e+02 1.46084638e-01 -1.69399432e+00 8.94635947e+01
1716.lowfreq: -3.6580 -2.6654 -0.0025 -0.0022 -0.0017 2.5570 18.1431 30.1864 41.7158
frequency: 18.1337 30.1551 41.7063 54.1630 81.8722 116.4505 129.0802 140.1943 147.8221 179.7406 186.1304 218.6667 241.1309 256.7199 278.6868 309.0276 336.5759 368.7067 386.9132 392.3510 432.7053 433.9229 517.6315 523.9676 565.5370 577.7232 602.3718 623.3032 640.1545 679.5398 707.8336 764.3134 803.7150 838.7167 881.6080 900.6442 908.6617 958.4996 971.5218 981.7047 991.9485 1005.5459 1024.6077 1125.0281 1151.2216 1212.2363 1259.2230 1301.7261 1346.6574 1358.7013 1381.4838 1411.1964 1414.0179 1416.0216 1480.4916 1554.4756 1593.7054 3031.9800 3151.5143 3166.9994 3184.7329 3185.0202 3189.2526
redmass: 7.0354 9.9615 16.6182 12.0354 7.6496 4.0517 1.4103 3.8368 7.2450 6.8509 21.2880 5.9581 6.3909 14.6082 8.3690 11.5751 8.9231 8.5400 10.6829 10.5249 3.1057 7.5639 8.4757 9.4734 8.8111 10.3940 13.5487 7.3577 9.0915 9.5747 3.2968 9.7505 12.9842 1.3437 1.5803 3.3300 8.9602 8.1521 1.8099 1.3561 3.4145 4.7485 1.8825 2.4429 1.3570 4.5763 1.4427 1.1537 5.0291 5.8937 5.1316 1.0557 1.0750 3.6133 4.1699 8.3844 6.4029 1.0240 1.0926 1.0890 1.1081 1.0977 1.1083
irintensity: 2.6557 1.2133 4.7769 1.0190 1.2098 9.1714 2.5179 1.7206 1.2370 1.0187 0.5564 0.3288 0.4154 6.0163 3.3421 6.9856 21.0309 5.0060 36.1252 95.2837 9.0464 1.3441 11.9579 37.6578 27.3807 33.0379 11.1179 3.4745 7.8750 8.4914 3.5685 18.0293 64.4546 28.1190 27.0217 29.9528 5.5330 77.7838 47.2658 1.1100 41.7643 21.2047 55.8047 61.6407 0.4978 17.0280 3.7461 6.7836 27.5082 28.8092 88.5492 17.5734 11.2460 176.3415 0.0800 19.7821 46.5250 0.7005 1.5221 0.3780 0.2201 1.2686 0.3595
temp: 298.150 k
press: 1.00000 atm
elementType: 17 17 16 16 8 8 7 7 6 6 6 6 6 6 6 6 6 1 1 1 1 1 1
symmnumber: 1
zpe: 353891.8 jmol-1
zpe.correction: 0.134790 hartree
zpe.thermalcorrener: 0.152218 hartree
zpe.thermalcorrenthalpy: 0.153162 hartree
zpe.thermalcorrgfe: 0.086299 hartree
zpe.sumelectzpe: -2321.305697 hartree
zpe.sumelectthermal: -2321.288270 hartree
zpe.sumelectthermalent: -2321.287326 hartree
zpe.sumelectthermalfe: -2321.354188 hartree
dipole: -1.7551 -2.9033 -2.8497
dipole: 4.4306
quadrupole: -134.6074 -130.4461 -131.5729
quadrupole: -8.4577 -16.4142 3.0982
quadrupole: -2.3986 1.7627 0.6359 -8.4577 -16.4142 3.0982
hfenergy: -2321.4404874 hartree
pointgroup: C01 [X(C9H6Cl2N2O2S2)]
dipole: -0.6702719 1.3016014 0.9460898 debye
dipolederiv: -0.2267688 -0.2235753 0.0493632 -0.3744968 -0.5183493 0.1062402 0.0777199 0.1010182 -0.040507 -0.995513 0.0418638 0.03475 0.0419092 -0.041599 0.0036902 0.0368345 0.0036572 -0.0133614 2.4592237 -0.1217018 -0.055701 -0.3884349 1.1812748 0.0592743 0.0437371 0.0328318 1.2982238 -0.3055903 -0.0397232 0.0316302 0.3394559 -0.3121319 0.0753567 -0.0199384 0.0896782 0.1801384 -0.7355414 0.0217661 0.0096565 0.178023 -0.5802492 -0.0021807 -0.1406636 0.1167605 -0.53865 -0.7882591 0.0269246 0.0317704 0.0058394 -0.4656661 0.0215116 0.1601914 -0.0706742 -0.6384827 -0.3648507 -0.0865551 0.0222825 0.1248756 -0.352357 0.0322855 0.0397278 0.044962 -0.1015855 -0.7727063 0.1139452 0.000769 -0.4293422 -0.3417579 0.0521212 0.0744418 0.0329494 -0.133961 -0.2560324 0.177012 -0.0243241 0.1377553 0.3030024 -0.0822933 -0.0768787 -0.0921116 -0.2433211 -0.479241 -0.00136 0.020933 0.1594873 0.0119902 -0.0032339 -0.0166715 0.0092027 0.0438224 1.2892147 -0.1413775 -0.0250704 -0.0906275 0.4420824 -0.0750605 -0.0330803 -0.0864963 0.0031192 -0.2229052 0.0029699 0.0107745 0.0086616 -0.1853771 -0.0331752 -0.0134882 -0.0305353 -0.1206133 0.0806939 -0.1757601 0.0238707 0.0702082 -0.1998234 0.0181963 -0.0195112 0.028661 -0.091718 0.0513063 0.0776719 -0.0214377 -0.2210095 0.0094217 -0.0123403 0.0320139 -0.0277528 -0.1080902 -0.1474959 0.5308636 -0.0917052 0.8024764 0.7974622 -0.1841807 -0.1418801 -0.1735133 0.0080663 -0.3431293 -0.0581616 0.022148 -0.213535 0.0190505 -0.0082054 0.0548587 -0.0153877 -0.0749757 1.3453075 -0.18901 -0.0266111 -0.1767094 -0.0651629 0.0103237 -0.030234 0.0112975 -0.0505733 0.1319854 0.0118967 -0.0439995 0.0278477 0.0239419 0.0144731 -0.0537924 0.0019542 0.0656443 0.0891217 -0.0380915 0.0228883 -0.0562025 0.0513353 -0.0236464 0.0503406 -0.0066564 -0.01311 -0.0138561 0.0119898 0.005643 -0.0298737 0.0922429 -0.0284875 -0.0198761 -0.0312849 0.1015604 0.06447 0.0728053 -0.0086016 0.0850126 0.0525604 0.015566 -0.0096987 0.0161621 0.1543561 0.1103423 -0.0622812 0.0137765 -0.0467043 0.0582737 0.0199872 0.0084551 0.0216282 0.1559278 0.0302241 0.0478886 -0.0028052 0.0453835 0.0198356 0.0237781 -0.0026076 0.0236495 0.1580904 unknown
polarizability: 344.8664018|4.5132438|171.0348051|-11.8238392|-15.7310692|92.9322245 unknown
InChI: InChI=1S/C9H6Cl2N2O2S2/c1-17(14,15)9-13-12-8(16-9)5-2-3-6(10)7(11)4-5/h2-4H,1H3
charge 0 multiplicity 1
23 atoms
Cl -4.197961 -2.476112 0.567598
Cl -5.895882 0.304464 0.138388
S  4.446018 -0.520279 -0.267095
S  1.263753 -1.11985 0.092136
O  4.519865 -1.855506 0.664839
O  4.913913 -0.548082 -1.823354
N  2.272702 1.30655 -0.4154
N  0.881477 1.501103 -0.381938
C  2.611017 0.05003 -0.192036
C  -1.266318 0.318332 -0.069956
C  0.195233 0.36916 -0.143717
C  5.310125 0.94826 0.605218
C  -1.958744 -0.895183 0.179997
C  -2.009736 1.519267 -0.254363
C  -3.363625 -0.90709 0.245404
C  -3.412619 1.499522 -0.188677
C  -4.095313 0.287914 0.0616
H  4.966768 1.855078 0.089482
H  4.999942 0.90889 1.657905
H  6.383744 0.756149 0.471114
H  -1.418814 -1.837029 0.324005
H  -1.473845 2.452178 -0.448153
H  -3.989101 2.417837 -0.3302
