program: Gaussian 09
title: 000287315
version: EM64L-G09RevD.01
frameworkgroup: C1[X(C8H4Cl2N2OS)]
method: RPBEPBE
basis: SDD
operation: Freq
keyword: #p
keyword: freq=noraman
keyword: PBEPBE/SDD
title: #p freq=noraman PBEPBE/SDD
converged: NO YES NO NO
title: Mulliken charges:
elementType: Cl Cl S O N N C C C C C C C C H H H H
charge: 0.000492 0.010614 0.188989 -0.152958 0.026162 -0.382318 0.582891 -0.355469 -0.335244 -0.372836 -0.070198 -0.194647 -0.111000 -0.010591 0.266540 0.280457 0.264216 0.364901
chargesum: 0.00000
title: Mulliken charges with hydrogens summed into heavy atoms:
elementType: Cl Cl S O N N C C C C C C C C
charge: 0.000492 0.010614 0.188989 -0.152958 0.026162 -0.017417 0.582891 -0.355469 -0.068704 -0.092380 -0.070198 0.069569 -0.111000 -0.010591
polarizability: 2.61226138e+02 1.92100656e+00 1.39645322e+02 -3.21356230e-02 -8.69148306e-03 4.99253637e+01
1716.lowfreq: -7.0714 -2.6543 -0.0032 -0.0026 -0.0024 3.7951 31.2718 53.9643 86.3436
frequency: 31.2341 53.9464 86.3409 111.7233 163.7293 181.2914 234.0622 256.0179 258.2462 365.4262 367.9070 407.2326 435.8813 437.4946 487.8375 531.7044 560.4016 579.9748 584.4098 615.5106 646.8834 655.8285 707.5482 721.4938 778.2656 834.8419 883.5136 960.2915 975.4597 1003.7576 1077.1932 1096.5958 1124.6935 1150.4465 1251.9167 1291.5639 1357.9233 1387.2423 1395.9228 1460.6725 1516.8323 1560.1756 1596.8864 1700.6217 3152.1820 3162.5851 3181.6523 3587.0897
redmass: 12.0518 12.0468 13.2275 9.3170 6.1332 29.7377 16.6466 8.0020 14.6108 11.1784 7.7446 14.7339 3.1400 7.1462 12.0300 7.6933 7.4617 3.8432 9.9435 6.8392 1.3753 7.6253 3.2406 12.2132 9.4252 1.3536 1.5694 6.8193 1.3568 4.9401 5.7682 6.6919 2.4448 1.3368 1.4262 3.9088 4.3237 4.0453 1.4600 2.8298 7.5055 8.5186 6.4190 10.6528 1.0923 1.0887 1.0974 1.0802
irintensity: 0.3901 0.3324 0.5340 0.0525 1.3727 0.0805 0.3695 0.5371 0.3993 0.1362 6.0213 7.4479 6.5544 8.4656 19.7427 3.7661 61.4032 3.3307 1.7283 0.8385 138.6113 10.9155 5.1634 32.1968 5.5506 31.9994 31.2784 88.2321 1.1930 22.0560 16.3870 23.9042 50.5129 0.0173 26.0365 121.7119 15.3526 10.9063 7.5863 63.9839 11.7311 23.2596 10.6144 759.1001 1.0981 0.3136 1.2522 99.8483
temp: 298.150 k
press: 1.00000 atm
elementType: 17 17 16 8 7 7 6 6 6 6 6 6 6 6 1 1 1 1
symmnumber: 1
zpe: 280945.7 jmol-1
zpe.correction: 0.107007 hartree
zpe.thermalcorrener: 0.119313 hartree
zpe.thermalcorrenthalpy: 0.120258 hartree
zpe.thermalcorrgfe: 0.066300 hartree
zpe.sumelectzpe: -1809.170188 hartree
zpe.sumelectthermal: -1809.157881 hartree
zpe.sumelectthermalent: -1809.156937 hartree
zpe.sumelectthermalfe: -1809.210894 hartree
dipole: 0.0823 -3.0852 0.0000
dipole: 3.0863
quadrupole: -117.6897 -94.4051 -103.0860
quadrupole: 8.6146 -0.0002 -0.0074
quadrupole: -12.6294 10.6552 1.9743 8.6146 -0.0002 -0.0074
hfenergy: -1809.2771942 hartree
pointgroup: C01 [X(C8H4Cl2N2O1S1)]
dipole: -0.0523261 -1.2126269 -0.0346639 debye
dipolederiv: -0.2634285 0.2590805 0.0036585 0.3674339 -0.5210413 -0.0082449 0.006703 -0.0098571 -0.0265736 -0.9168193 -0.0852436 -0.01585 -0.0962437 -0.0588465 -0.0025416 -0.0161783 -0.0023977 -0.0194766 -0.7332002 -0.0391512 -0.0122453 0.1351659 -0.2582642 -0.0074998 -0.0071964 -0.0096689 0.0608708 -1.7895001 -0.2174607 -0.0269922 -0.4743214 -0.3996166 -0.0097635 -0.0341233 -0.0061433 -0.2910409 0.4770056 -0.1662952 0.0029966 0.1932326 -0.5870524 -0.0115242 0.0114329 -0.0166351 -0.0784034 -1.1075215 0.1598233 -0.0073512 -0.8054483 -0.3488615 -0.0128333 -0.0332896 0.001014 -0.3075349 0.030299 -0.0122872 -0.0008804 -0.2265629 -0.0364251 -0.0061951 -0.0066396 -0.002845 0.0622754 0.7222594 0.22279 0.0186516 0.6122278 0.5716527 0.0273417 0.0302238 0.0213291 -0.0719479 -0.0742369 0.1794449 0.0054672 0.0804871 -0.1882048 -0.0013116 0.0021629 0.0002672 -0.1031765 -0.0656684 -0.057777 -0.0004269 0.0788874 0.0220666 0.0055564 0.0031939 0.0034332 -0.1353632 0.0777399 -0.5691991 -0.0142431 -0.7241255 0.7828793 0.011758 -0.0185201 0.0140121 -0.0285156 -0.26641 0.0039477 -0.0027387 0.1187082 0.0366611 0.0049916 0.000472 0.0032729 -0.0783241 1.1780455 0.2651726 0.0259567 0.2190284 -0.0798865 0.0026832 0.0246205 0.0033963 -0.0582642 2.3040393 0.1647918 0.0333625 0.6991318 0.7539335 0.0254766 0.0482872 0.0176699 0.2151664 0.0867524 -0.0691717 -0.0030943 -0.0761646 0.0390514 -0.0044782 -0.003127 -0.0044382 0.1609815 0.0775224 0.0742454 0.0007539 0.0444103 0.0394201 -0.002704 -0.0001196 -0.002241 0.1616395 0.0404442 -0.0497724 -0.0032094 -0.0483141 -0.0003916 -0.0052489 -0.0031244 -0.0052617 0.1620961 0.2226769 -0.0629383 -0.0038155 -0.0975329 0.2329258 -0.0054623 -0.0047779 -0.0049067 0.3755909 unknown
polarizability: 261.0841931|-4.0051922|139.6742163|3.0000868|2.4562212|50.038414 unknown
InChI: InChI=1S/C8H4Cl2N2OS/c9-5-2-1-4(3-6(5)10)7-11-12-8(13)14-7/h1-3,12H
charge 0 multiplicity 1
18 atoms
Cl -3.307425 2.405262 0.035382
Cl -4.809962 -0.517967 -0.068532
S  2.215766 1.384673 0.091525
O  4.985272 0.788073 0.111921
N  2.038222 -1.288835 0.013003
N  3.387658 -0.967945 0.040293
C  -0.179888 -0.24713 0.009094
C  1.286663 -0.192079 0.03328
C  -0.957526 0.938574 0.03007
C  -0.838477 -1.508498 -0.036084
C  -2.362901 0.864077 0.006675
C  -2.241166 -1.575491 -0.059269
C  -3.009924 -0.389533 -0.037894
C  3.818957 0.363236 0.083851
H  -0.480621 1.923731 0.064465
H  -0.240188 -2.423465 -0.052202
H  -2.752341 -2.541743 -0.093799
H  4.053382 -1.74084 0.027322
