program: Gaussian 09
title: 000287399
version: EM64L-G09RevD.01
frameworkgroup: C1[X(C25H21ClN2O)]
method: RPBEPBE
basis: SDD
operation: Freq
keyword: #p
keyword: freq=noraman
keyword: PBEPBE/SDD
title: #p freq=noraman PBEPBE/SDD
converged: YES YES NO NO
title: Mulliken charges:
elementType: Cl O N N C C C C C C C C C C C C C C C C C C C C C C C C C H H H H H H H H H H H H H H H H H H H H H
charge: -0.063112 -0.288498 -0.238721 -0.026821 -0.020656 -0.478965 0.025172 -0.360682 0.222518 0.197391 0.202906 0.158671 0.242502 0.199311 -0.640422 -0.574611 -0.361364 -0.112646 -0.868831 -0.503295 -0.391118 -0.240068 -0.253699 0.364125 -0.379791 -0.387674 -0.219505 -0.226598 -0.113679 0.259237 0.255901 0.251151 0.217453 0.229616 0.277969 0.220763 0.230812 0.278257 0.234082 0.256621 0.238893 0.231489 0.215404 0.237959 0.224726 0.224736 0.274067 0.269325 0.254192 0.255509
chargesum: 0.00000
title: Mulliken charges with hydrogens summed into heavy atoms:
elementType: Cl O N N C C C C C C C C C C C C C C C C C C C C C C C C C
charge: -0.063112 -0.288498 -0.238721 -0.026821 0.238581 0.028088 0.025172 0.086387 0.222518 0.197391 0.202906 0.158671 0.242502 0.199311 -0.362454 -0.123036 -0.083107 -0.112646 -0.139234 -0.056403 -0.153159 -0.015342 -0.028962 0.364125 -0.105724 -0.118349 0.034687 0.028911 -0.113679
polarizability: 4.40472387e+02 8.84575097e+00 3.66665336e+02 -8.71084922e+00 -5.38537298e+00 1.63264110e+02
1716.lowfreq: -1.8927 -0.0014 -0.0008 0.0010 2.2921 5.1421 19.1706 30.5836 48.7322
frequency: 19.1536 30.5694 48.7233 54.1937 63.5742 71.4809 74.1253 99.1101 110.3444 136.3338 141.8502 166.2713 193.6086 196.6470 211.4311 236.0812 244.0246 263.5603 275.6514 286.5460 316.2259 323.9773 347.0895 350.3775 355.8623 378.5488 412.4989 425.6961 432.7944 444.8418 457.1605 477.3657 510.3651 520.9374 548.6808 550.6488 573.0939 589.2806 595.9271 625.9602 628.9329 659.4468 687.7438 700.9912 705.7082 711.0460 728.8914 736.0205 756.5329 763.8435 780.9074 808.0128 811.8351 830.9441 840.3452 851.8316 867.7627 875.0294 888.2772 900.4705 919.7444 941.4646 945.1956 961.8743 969.1980 974.3483 979.4717 998.0121 1006.4342 1021.7415 1029.3455 1035.0522 1038.4273 1048.8334 1063.2452 1072.1082 1086.2142 1090.7719 1107.8515 1114.9853 1135.3799 1136.8267 1154.5950 1166.0287 1179.8296 1182.1726 1204.4787 1221.8716 1232.5296 1236.6956 1259.8432 1283.1764 1292.4572 1298.6697 1308.3694 1314.3130 1337.3264 1342.3729 1359.8328 1364.9308 1385.5643 1392.2488 1394.6148 1397.8643 1408.8319 1428.0589 1443.4677 1447.3386 1454.8077 1463.1562 1467.8568 1476.3674 1481.6910 1482.8314 1490.3780 1502.3207 1540.0619 1570.4521 1583.9151 1590.9232 1596.0177 1607.8236 1632.4432 2945.0924 2960.3095 2970.8880 3002.1122 3050.6895 3055.2880 3061.2815 3064.8260 3090.9326 3097.7312 3106.4198 3128.1291 3138.2572 3146.2047 3153.1157 3154.2866 3156.6506 3165.6691 3170.3800 3172.0617 3176.1680
redmass: 6.6125 8.5839 4.9582 4.3795 5.0929 3.7386 4.6700 4.2912 5.7789 3.3538 4.7868 5.4324 1.5285 3.7075 3.3000 3.9821 4.7083 3.9732 3.6804 4.2178 4.8459 3.3877 2.7452 4.7078 4.0967 4.4224 2.9768 4.5638 2.3467 3.6286 4.7122 4.3161 3.9507 5.2376 3.3943 4.2750 4.0833 5.1489 4.9138 6.3074 5.4868 4.8324 5.7190 4.7398 4.8497 4.6801 4.1542 3.7255 1.5263 4.2118 3.0616 2.6871 4.6444 1.2747 1.6417 2.8157 1.4174 2.6309 2.8554 4.2568 1.5212 2.4611 1.3898 1.3615 1.5380 1.3670 1.3052 4.3448 2.2301 1.9827 1.6236 1.5804 3.0515 2.7064 3.2796 2.4943 2.0250 1.7394 1.3638 1.4742 1.7046 1.5984 1.7430 1.3447 1.4441 1.1772 1.7578 1.9041 1.2962 1.6856 2.6176 1.9447 1.2676 1.3880 1.8126 2.7410 1.5870 1.6997 2.6379 5.4461 4.2353 3.4865 1.8596 1.3038 5.0388 2.2193 3.0532 1.1965 1.1339 1.3775 2.9723 2.4367 1.2164 1.5928 1.7764 1.1269 7.2818 8.4875 8.2049 7.1963 6.3850 7.5087 7.4924 1.0696 1.0653 1.0445 1.0684 1.0942 1.0925 1.0907 1.0535 1.0939 1.0937 1.0933 1.0854 1.0902 1.0891 1.0945 1.0917 1.0884 1.1002 1.0962 1.1181 1.0974
irintensity: 0.0714 0.1295 0.7498 0.2971 2.0899 5.7830 1.6303 1.9504 1.0876 1.0893 0.6554 0.4520 0.3319 0.4250 1.9630 0.8399 1.2847 3.0549 7.0178 0.3455 2.3301 2.2856 4.8790 0.5684 2.0804 6.4343 0.2557 3.5932 19.3032 4.0073 16.6947 9.4879 0.1620 4.7906 18.8635 1.9756 1.4624 0.3431 9.7015 0.2718 3.3518 6.0320 12.2235 4.4554 11.4666 4.9946 9.2378 16.3194 67.1734 6.1898 25.5046 22.8346 49.1318 5.4195 40.8076 10.2574 0.5824 4.9944 9.9409 6.6201 11.6868 6.8388 2.5386 0.1785 15.9395 4.0904 0.2515 42.3104 12.1060 12.2561 2.1931 8.4554 6.2164 12.6195 1.0841 41.9535 6.9424 18.7239 8.2845 6.3884 12.2199 8.9285 15.0541 9.3227 3.1547 19.4960 21.4011 39.1989 7.2153 40.4843 2.5822 81.6448 3.8131 11.6483 57.4701 3.2273 70.9157 51.1501 67.0218 41.1608 33.3989 34.9266 7.9149 4.4799 5.3155 18.0350 18.0808 22.9225 8.4842 26.8712 36.8737 63.2109 1.8316 21.6326 22.0150 4.8394 71.8041 2.6402 29.6948 10.0484 42.4678 55.0874 16.2659 48.6979 33.9136 39.4231 32.8958 54.6300 38.9028 17.8362 33.9632 11.4665 13.8292 8.2210 0.2536 14.2345 9.8271 4.9880 4.4490 0.9228 31.0300 5.8855 24.0696 2.7365
temp: 298.150 k
press: 1.00000 atm
elementType: 17 8 7 7 6 6 6 6 6 6 6 6 6 6 6 6 6 6 6 6 6 6 6 6 6 6 6 6 6 1 1 1 1 1 1 1 1 1 1 1 1 1 1 1 1 1 1 1 1 1
symmnumber: 1
zpe: 1030682.9 jmol-1
zpe.correction: 0.392566 hartree
zpe.thermalcorrener: 0.416818 hartree
zpe.thermalcorrenthalpy: 0.417763 hartree
zpe.thermalcorrgfe: 0.337707 hartree
zpe.sumelectzpe: -1608.006355 hartree
zpe.sumelectthermal: -1607.982103 hartree
zpe.sumelectthermalent: -1607.981159 hartree
zpe.sumelectthermalfe: -1608.061214 hartree
dipole: -6.3096 3.6580 -0.3602
dipole: 7.3022
quadrupole: -176.5078 -166.8744 -176.3809
quadrupole: -17.8836 -2.1827 2.5838
quadrupole: -3.2535 6.3800 -3.1265 -17.8836 -2.1827 2.5838
hfenergy: -1608.3989217 hartree
pointgroup: C01 [X(C25H21Cl1N2O1)]
dipole: -2.3483287 1.6283258 -0.2958312 debye
polarizability: 440.3940548|-0.8619448|360.0309168|-19.5250816|-33.5824142|169.9768606 unknown
InChI: InChI=1S/C25H21ClN2O/c1-15-19-10-11-27-24(16-6-8-17(26)9-7-16)21(19)12-22-20-4-2-3-5-23(20)28(25(15)22)13-18-14-29-18/h2-9,12,18H,10-11,13-14H2,1H3
charge 0 multiplicity 1
50 atoms
Cl 6.995224 -2.73156 0.998451
O  -5.991109 -0.027229 1.454088
N  -2.933714 0.137498 -0.023528
N  3.103859 2.438104 -1.077018
C  -4.974069 1.047129 1.127601
C  -4.201902 0.865066 -0.172334
C  -1.61037 0.638828 -0.127114
C  -6.436308 1.369549 1.096921
C  -0.718306 -0.486692 -0.238813
C  -2.88535 -1.280088 -0.034733
C  -1.117495 1.977824 -0.112277
C  -1.523614 -1.697967 -0.17531
C  0.279075 2.151799 -0.300934
C  1.178947 1.031114 -0.400489
C  0.667127 -0.286427 -0.36526
C  0.925447 3.527936 -0.416992
C  -3.947435 -2.203885 0.06489
C  2.638053 1.306581 -0.57677
C  -2.012007 3.182189 0.157824
C  2.092143 3.466239 -1.428728
C  -1.216681 -3.077121 -0.226598
C  -3.617664 -3.576085 0.005761
C  -2.270684 -4.011363 -0.139587
C  3.665035 0.282048 -0.194088
C  4.86736 0.193741 -0.94516
C  3.509112 -0.558044 0.940937
C  5.881901 -0.719301 -0.593313
C  4.519949 -1.471634 1.314556
C  5.689098 -1.542429 0.534345
H  -4.383346 1.353373 2.000854
H  -4.000507 1.848415 -0.623822
H  -4.846659 0.309523 -0.880914
H  -6.947607 1.452363 0.12851
H  -6.882591 1.93902 1.920456
H  1.340787 -1.142587 -0.463497
H  0.202961 4.295452 -0.743054
H  1.326734 3.850057 0.56772
H  -4.980081 -1.877945 0.223211
H  -2.507818 3.56604 -0.756027
H  -1.430541 4.016178 0.581469
H  -2.797718 2.941931 0.894385
H  2.608492 4.440388 -1.485345
H  1.693572 3.242454 -2.443206
H  -0.180618 -3.417369 -0.332992
H  -4.417102 -4.321003 0.087877
H  -2.052303 -5.084039 -0.176603
H  4.995671 0.864187 -1.800021
H  2.607494 -0.483158 1.557154
H  6.802024 -0.790368 -1.180388
H  4.401333 -2.107335 2.196708
