program: Gaussian 09
title: 000287313
version: EM64L-G09RevD.01
frameworkgroup: C1[X(C7H5N3OS)]
method: RPBEPBE
basis: SDD
operation: Freq
keyword: #p
keyword: freq=noraman
keyword: PBEPBE/SDD
title: #p freq=noraman PBEPBE/SDD
converged: NO YES NO NO
title: Mulliken charges:
elementType: S O N N N C C C C C C C H H H H H
charge: 0.187124 -0.152384 0.025747 -0.381573 -0.000924 0.548098 -0.323150 -0.286378 -0.309062 -0.012824 -0.330451 -0.331322 0.267746 0.238582 0.366050 0.247661 0.247061
chargesum: 0.00000
title: Mulliken charges with hydrogens summed into heavy atoms:
elementType: S O N N N C C C C C C C
charge: 0.187124 -0.152384 0.025747 -0.015523 -0.000924 0.548098 -0.323150 -0.018632 -0.070481 -0.012824 -0.082790 -0.084261
polarizability: 1.94833420e+02 4.22375635e+00 1.15373172e+02 1.01061860e-02 -1.72580585e-02 4.39137514e+01
1716.lowfreq: -9.0378 -3.2759 -0.0021 -0.0006 -0.0003 3.0767 41.6539 74.6607 122.9122
frequency: 41.5883 74.6537 122.9122 168.3187 282.2374 331.8813 339.0439 363.6410 415.0098 498.3848 546.4876 562.4294 575.9126 604.5509 649.2015 653.2832 665.5197 741.6734 742.2579 834.5462 883.1103 955.7390 959.5359 968.7788 983.3202 1060.5930 1073.4165 1080.3732 1106.4488 1220.4569 1292.2424 1299.9107 1331.3951 1395.7326 1403.4063 1461.4615 1511.4626 1549.7007 1585.6021 1700.2081 3134.0247 3141.1845 3156.1549 3176.5896 3585.6515
redmass: 5.0984 11.5182 7.3477 8.2161 8.9629 7.8321 10.1750 2.5047 12.1595 5.9734 9.1520 9.3235 3.5283 5.8227 1.3636 8.1344 7.7548 3.1795 10.6129 1.4773 1.2562 6.4449 7.2802 1.4110 1.4450 2.2252 5.7845 2.4103 2.6713 1.2719 5.2214 5.4575 1.4577 1.3722 1.9664 2.0558 7.0288 7.4778 5.5967 10.6240 1.0878 1.0898 1.0976 1.0965 1.0803
irintensity: 0.4655 1.3027 1.0403 0.0025 1.2222 11.5070 0.9464 0.0767 2.4055 9.6380 4.2148 56.5331 0.7440 5.6874 140.6004 17.4660 13.1872 2.5393 4.7648 68.4741 1.1302 25.0612 9.9063 0.5639 0.6138 5.0165 8.8910 20.2880 21.2897 0.1908 86.0877 9.0256 8.3641 4.6616 25.4079 6.3994 12.4187 4.7007 48.7738 691.4244 11.1198 19.4966 12.7537 5.0440 94.0150
temp: 298.150 k
press: 1.00000 atm
elementType: 16 8 7 7 7 6 6 6 6 6 6 6 1 1 1 1 1
symmnumber: 1
zpe: 300442.3 jmol-1
zpe.correction: 0.114432 hartree
zpe.thermalcorrener: 0.124050 hartree
zpe.thermalcorrenthalpy: 0.124994 hartree
zpe.thermalcorrgfe: 0.078122 hartree
zpe.sumelectzpe: -906.429760 hartree
zpe.sumelectthermal: -906.420143 hartree
zpe.sumelectthermalent: -906.419199 hartree
zpe.sumelectthermalfe: -906.466071 hartree
dipole: 0.0286 1.6410 0.0038
dipole: 1.6413
quadrupole: -97.5980 -66.0006 -78.2384
quadrupole: 7.2416 0.0235 -0.0175
quadrupole: -16.9857 14.6117 2.3739 7.2416 0.0235 -0.0175
hfenergy: -906.5441927 hartree
pointgroup: C01 [X(C7H5N3O1S1)]
dipole: 0.0267584 -0.6431109 -0.0515984 debye
dipolederiv: -0.6575727 -0.0110204 -0.009427 0.1869703 -0.2732859 -0.0247807 0.006151 -0.0268208 0.0612487 -1.7445752 -0.0978499 -0.02532 -0.297748 -0.3508683 -0.0084499 -0.0408573 -0.0060124 -0.2913128 0.5052456 -0.2731261 -0.0151041 -0.0344176 -0.5665606 -0.0402132 0.005197 -0.043102 -0.0760824 -1.0983155 0.207581 0.0074965 -0.6627928 -0.3043074 -0.0076245 -0.0633538 0.0027067 -0.3061936 -0.4542964 0.0000482 -0.0023449 0.0334116 -0.3015065 -0.0037356 0.0001924 -0.0042301 -0.2461225 0.3364519 -0.0408896 -0.0001559 -0.2135805 0.0640604 -0.0034897 -0.0147389 -0.0013741 0.0713706 0.4912183 0.2562432 0.0269525 0.6290502 0.5265223 0.0561779 0.0572696 0.0514028 -0.0739034 -0.3715683 -0.1984782 -0.0184761 -0.0118902 -0.0390125 0.003064 -0.0041075 0.001145 -0.0810351 -0.2725588 0.2203021 0.014819 0.1188281 -0.1074772 0.0006448 0.007079 0.0020482 -0.0988258 2.2716258 0.0326492 0.0273753 0.4834451 0.6938238 0.0442787 0.0634578 0.0389513 0.2176524 0.3111839 0.2620086 0.0243311 0.0822387 0.2375936 0.024443 0.0105392 0.0265627 -0.0699413 0.25857 -0.2525506 -0.0156141 -0.1667212 0.2826826 0.0247948 -0.0087658 0.0237091 -0.065296 0.0996119 0.0835512 0.005743 0.0442272 0.011188 -0.0104657 0.0025991 -0.0101702 0.1553733 0.0532478 -0.1102991 -0.0096558 -0.1000613 0.0116461 -0.0121814 -0.008775 -0.0124951 0.1553687 0.203835 -0.0588155 -0.0067803 -0.0820705 0.2466408 -0.0114276 -0.0087889 -0.0111996 0.3755478 0.0215397 -0.0920554 -0.0083429 -0.0853155 -0.056304 -0.0157671 -0.0078701 -0.0158574 0.1366232 0.0463567 0.0727014 0.0045039 0.0764264 -0.0748353 -0.0152677 0.0047724 -0.0152642 0.1355281 unknown
polarizability: 194.9701127|-2.4434556|114.7879236|1.5555433|5.5100884|44.3623075 unknown
InChI: InChI=1S/C7H5N3OS/c11-7-10-9-6(12-7)5-1-3-8-4-2-5/h1-4,10H
charge 0 multiplicity 1
17 atoms
S  1.710253 1.369454 0.15985
O  4.403476 0.492575 0.121941
N  1.260656 -1.26492 -0.056921
N  2.634509 -1.085456 -0.026181
N  -3.695309 0.153523 -0.000003
C  -0.839315 -0.000996 0.020622
C  0.62554 -0.100266 0.029501
C  -1.636873 -1.175033 -0.078123
C  -1.506081 1.248159 0.108638
C  3.199535 0.192131 0.083537
C  -3.039543 -1.046143 -0.083999
C  -2.918043 1.272815 0.094484
H  -1.161137 -2.15696 -0.147805
H  -0.946485 2.186723 0.186881
H  3.217806 -1.920413 -0.086814
H  -3.679798 -1.931885 -0.158753
H  -3.457988 2.223692 0.160848
