program: Gaussian 09
title: 000287310
version: EM64L-G09RevD.01
frameworkgroup: C1[X(C6H12N4O2)]
method: RPBEPBE
basis: SDD
operation: Freq
keyword: #p
keyword: freq=noraman
keyword: PBEPBE/SDD
title: #p freq=noraman PBEPBE/SDD
converged: YES YES NO NO
title: Mulliken charges:
elementType: O O N N N N C C C C C C H H H H H H H H H H H H
charge: -0.271523 -0.271535 -0.377595 -0.377586 -0.505446 -0.505436 -0.272334 -0.272292 -0.463914 -0.463947 0.204024 0.203965 0.273680 0.273697 0.233794 0.242073 0.233794 0.242129 0.326395 0.326414 0.305591 0.305236 0.305589 0.305227
chargesum: 0.00000
title: Mulliken charges with hydrogens summed into heavy atoms:
elementType: O O N N N N C C C C C C
charge: -0.271523 -0.271535 -0.051200 -0.051172 0.105380 0.105381 0.001346 0.001405 0.011953 0.011976 0.204024 0.203965
polarizability: 1.09914981e+02 -6.42106786e-05 9.63768189e+01 -1.17734403e+00 -9.24023900e-03 8.73114224e+01
1716.lowfreq: -6.1455 -4.6416 0.0006 0.0010 0.0010 10.9943 14.2072 24.2772 64.9683
frequency: 13.5779 24.1337 64.9643 111.4039 116.7275 129.2609 133.9002 164.6249 211.1257 225.6903 267.9025 298.4714 307.4929 370.9630 390.8158 565.1584 573.9089 574.6341 694.6620 706.2724 715.7350 756.9717 775.7783 777.3442 834.4794 865.8665 914.0220 947.6232 983.3209 986.1339 1041.1410 1056.1227 1074.5614 1109.6028 1144.4536 1193.1748 1200.9496 1206.7403 1239.4082 1240.7509 1253.1287 1256.7755 1284.6110 1284.9794 1332.4578 1375.8488 1439.9086 1445.0422 1457.4408 1467.7571 1609.4847 1613.9092 1678.8645 1679.5333 3021.8804 3025.7241 3031.7178 3031.7723 3097.7437 3115.1312 3392.2052 3392.2516 3507.2592 3507.2914 3547.1445 3547.3226
redmass: 6.4638 6.0998 4.9505 1.8199 1.3038 1.8751 2.3296 2.6374 3.0452 3.4295 4.8221 3.7182 4.8802 4.7196 4.8154 3.2553 1.1647 1.1984 2.7600 2.7798 3.9597 3.8135 1.8791 1.6694 1.5709 3.6681 2.1797 2.6606 3.4958 5.5733 3.0391 2.2933 1.7364 2.2700 3.0518 1.3542 1.4721 1.1406 1.6388 1.5947 1.7541 1.6366 1.1633 1.1628 1.6135 1.6010 1.7379 1.7852 1.0861 1.1535 7.0158 6.5777 1.0632 1.0633 1.0851 1.0574 1.0845 1.0621 1.1087 1.1081 1.0428 1.0428 1.0986 1.0986 1.0796 1.0796
irintensity: 4.2271 1.9442 3.2319 19.2447 27.4102 3.2189 1.6293 4.0297 9.0412 4.1272 20.8718 38.2111 28.8845 0.0088 4.2664 4.1724 128.0642 164.3444 13.5625 3.4336 0.3131 1.9739 177.9149 89.3527 5.4072 9.3576 1.1169 10.1164 23.7954 0.1272 0.3373 0.0917 0.0980 9.4287 17.1965 0.5795 8.7817 2.9625 1.7591 22.2690 36.6355 41.4045 0.0392 0.1394 35.8695 1.3749 232.5422 117.2789 8.9173 0.1038 275.3645 6.7848 55.2077 1.1112 2.0217 33.3839 9.7685 41.1724 12.6827 36.7050 0.4855 0.1045 1.8155 1.6293 53.9223 13.4255
temp: 298.150 k
press: 1.00000 atm
elementType: 8 8 7 7 7 7 6 6 6 6 6 6 1 1 1 1 1 1 1 1 1 1 1 1
symmnumber: 1
zpe: 510847.6 jmol-1
zpe.correction: 0.194572 hartree
zpe.thermalcorrener: 0.208159 hartree
zpe.thermalcorrenthalpy: 0.209104 hartree
zpe.thermalcorrgfe: 0.151855 hartree
zpe.sumelectzpe: -604.291622 hartree
zpe.sumelectthermal: -604.278035 hartree
zpe.sumelectthermalent: -604.277090 hartree
zpe.sumelectthermalfe: -604.334339 hartree
dipole: 0.0024 0.3635 -0.0004
dipole: 0.3635
quadrupole: -69.7510 -67.3394 -76.8211
quadrupole: 0.0049 -4.7452 0.0111
quadrupole: 1.5528 3.9645 -5.5173 0.0049 -4.7452 0.0111
hfenergy: -604.486194 hartree
pointgroup: C01 [X(C6H12N4O2)]
dipole: 0.001083 -0.1429954 -0.0000764 debye
dipolederiv: -0.5794 -0.093169 0.1733139 -0.1722715 -0.4629945 0.0193908 -0.0119284 -0.1322621 -0.9025377 -0.580078 0.0916502 0.17422 0.1722086 -0.4632567 -0.0163105 -0.0106323 0.1351033 -0.9016517 -0.3545974 0.0290597 -0.2898568 -0.0178455 -0.4728173 -0.21333 -0.4067975 -0.3130906 -0.4463416 -0.3540214 -0.0274085 -0.2904573 0.0203883 -0.4758232 0.2124714 -0.407271 0.3120018 -0.4438979 -0.1795082 -0.1298719 -0.0783323 -0.1724686 -0.1831451 -0.1445584 -0.1592426 -0.1940054 -0.3560229 -0.1796932 0.1301496 -0.0775085 0.1733525 -0.1849002 0.1456803 -0.1581692 0.1950009 -0.3540038 -0.1486576 -0.1104756 -0.0310312 -0.2174354 -0.1825556 0.004259 0.0399069 -0.036994 0.0328838 -0.1499018 0.1107654 -0.0304533 0.2170245 -0.181729 -0.0052687 0.0406896 0.0363085 0.033084 0.0034768 -0.0548966 0.0143702 0.0131462 0.1314439 -0.1024919 0.0302579 -0.0064129 0.1479826 0.0034529 0.0545153 0.0144536 -0.0135111 0.1308137 0.102497 0.0302955 0.0064271 0.148445 0.7307851 0.4464142 0.0817011 0.5613931 0.5733662 0.2815005 0.1571094 0.3657753 1.1531817 0.7326383 -0.446043 0.0790639 -0.5618802 0.5752792 -0.2853618 0.1539208 -0.3695298 1.1493699 0.0773179 -0.0355231 0.0349387 -0.0313955 0.031894 -0.0531604 0.0119616 -0.0358736 -0.074358 0.0772649 0.0354855 0.0350159 0.0315499 0.0316171 0.0537765 0.0120344 0.0363401 -0.073865 0.01628 0.0537059 -0.0556228 0.0399485 -0.0572824 0.0851293 -0.0980359 0.1350771 -0.0501013 -0.0121507 0.0489004 0.0667887 0.0224313 0.0744556 0.0022709 0.0885385 -0.0591506 -0.0283822 0.0165135 -0.0532942 -0.0556733 -0.0393137 -0.0564644 -0.0853189 -0.0979012 -0.1353584 -0.051107 -0.0119009 -0.0494412 0.0665153 -0.0230538 0.0741214 -0.0016527 0.0881966 0.0598422 -0.0280591 0.17979 -0.1170924 0.0754033 -0.1091261 0.2417014 0.007383 0.1035794 0.0313613 0.1670672 0.1793874 0.1164811 0.0762451 0.1084735 0.2422009 -0.006554 0.1043576 -0.0305993 0.1670711 0.0969182 0.0154575 -0.0556829 0.0311763 0.2256867 0.073237 0.0276528 0.2095477 0.1354774 0.1696642 0.0193932 0.0642777 0.0621532 0.0805685 -0.0347553 0.2171156 0.0102429 0.2208701 0.0970282 -0.0150503 -0.0557454 -0.0314354 0.227515 -0.0726692 0.0276308 -0.2088245 0.1334944 0.1693919 -0.0197122 0.0640563 -0.0635093 0.080305 0.0338365 0.2167308 -0.0109268 0.221401 unknown
polarizability: 109.4803264|0.0070447|96.3768192|3.319913|0.0127845|87.7460766 unknown
InChI: InChI=1S/C6H12N4O2/c7-9-5(11)3-1-2-4(3)6(12)10-8/h3-4,9-10H,1-2,7-8H2
charge 0 multiplicity 1
24 atoms
O  2.164898 0.233418 -1.251325
O  -2.16847 0.220874 1.254726
N  2.432966 0.945296 0.945193
N  -2.435756 0.945696 -0.937633
N  3.538345 1.797467 0.677125
N  -3.542599 1.794601 -0.665236
C  0.644601 -0.668977 0.45018
C  -0.644969 -0.668439 -0.450754
C  0.755438 -2.220785 0.207033
C  -0.752091 -2.221574 -0.214779
C  1.794761 0.195666 -0.03633
C  -1.79718 0.191142 0.039856
H  0.359895 -0.45296 1.496254
H  -0.360747 -0.446843 -1.495786
H  1.046773 -2.837584 1.071475
H  1.421157 -2.432285 -0.646965
H  -1.04198 -2.835076 -1.08205
H  -1.417293 -2.438542 0.638243
H  2.114584 0.927734 1.915485
H  -2.116321 0.93484 -1.907677
H  3.269879 2.526113 -0.000092
H  4.330142 1.249351 0.311066
H  -3.275917 2.518976 0.017252
H  -4.334121 1.24299 -0.303858
