program: Gaussian 09
title: 000287309
version: EM64L-G09RevD.01
frameworkgroup: C1[X(C8H8ClNO2)]
method: RPBEPBE
basis: SDD
operation: Freq
keyword: #p
keyword: freq=noraman
keyword: PBEPBE/SDD
title: #p freq=noraman PBEPBE/SDD
converged: YES YES NO NO
title: Mulliken charges:
elementType: Cl O O N C C C C C C C C H H H H H H H H
charge: -0.011546 -0.461575 -0.237723 -0.410539 0.496393 0.360786 -0.422439 -0.367717 -0.268027 -0.313176 -0.632032 0.100829 0.248365 0.243757 0.282217 0.307466 0.237750 0.227733 0.237718 0.381759
chargesum: 0.00000
title: Mulliken charges with hydrogens summed into heavy atoms:
elementType: Cl O O N C C C C C C C C
charge: -0.011546 -0.079816 -0.237723 -0.103073 0.496393 0.360786 -0.174075 -0.123960 -0.268027 -0.030959 0.071170 0.100829
polarizability: 1.90335186e+02 5.98003113e-01 1.19320922e+02 -1.86464803e-02 1.90373506e-02 4.83701929e+01
1716.lowfreq: -0.0017 0.0018 0.0019 3.5972 3.8374 5.9193 38.7269 77.6714 104.0843
frequency: 38.7199 77.6566 104.0783 162.0605 173.5117 193.4272 204.0765 283.1786 283.8892 329.1292 354.8620 424.0690 447.8160 498.8658 521.2249 557.2736 589.3386 596.2688 674.7475 677.1957 703.0549 747.4982 825.7884 852.5721 853.9232 975.8717 982.2219 1032.4141 1074.0571 1122.2600 1140.2009 1164.5417 1182.2696 1255.3648 1305.7828 1327.0653 1354.2876 1429.7144 1448.6780 1467.9690 1470.2767 1498.5375 1525.7843 1560.5369 1630.5532 1649.5698 2958.8078 3027.1895 3101.6348 3146.2183 3159.9408 3185.1322 3536.7677 3582.8592
redmass: 14.0762 4.0146 3.3593 4.4147 1.0918 11.0535 4.9713 5.0834 3.8599 7.9503 10.3283 1.2595 2.4952 6.4825 4.9300 1.5100 4.4399 2.6928 6.6053 3.0994 4.8163 4.0841 1.5218 5.8219 1.7064 5.6051 1.3511 2.8705 2.3836 1.2798 1.7520 1.6949 1.4991 1.3737 2.4795 2.3229 2.5102 3.9157 1.2371 2.2428 1.0410 1.1442 3.1977 3.7824 6.8632 8.4649 1.0372 1.1013 1.0969 1.0920 1.0885 1.0957 1.0642 1.0775
irintensity: 0.4635 2.2956 0.4343 0.9324 1.2607 0.2988 0.1039 1.9832 0.0239 1.7376 1.7323 139.0862 0.1989 3.6177 46.1240 68.9199 29.2354 37.5886 7.9159 55.8691 0.1991 9.0638 22.1511 31.7298 49.3675 262.2779 0.9627 139.5274 31.2115 1.5241 46.1080 81.9382 11.4760 16.8469 88.9933 50.9294 41.4513 22.8883 5.3488 53.8350 14.4890 23.0557 151.9130 35.8619 733.4169 209.8830 90.2082 42.9162 21.2810 4.1953 8.1587 4.4533 49.0327 61.5687
temp: 298.150 k
press: 1.00000 atm
elementType: 17 8 8 7 6 6 6 6 6 6 6 6 1 1 1 1 1 1 1 1
symmnumber: 1
zpe: 385620.6 jmol-1
zpe.correction: 0.146875 hartree
zpe.thermalcorrener: 0.158505 hartree
zpe.thermalcorrenthalpy: 0.159449 hartree
zpe.thermalcorrgfe: 0.108464 hartree
zpe.sumelectzpe: -974.042661 hartree
zpe.sumelectthermal: -974.031031 hartree
zpe.sumelectthermalent: -974.030087 hartree
zpe.sumelectthermalfe: -974.081072 hartree
dipole: 6.6772 -1.2382 0.0048
dipole: 6.7910
quadrupole: -62.1756 -70.7111 -79.8264
quadrupole: 9.3958 0.0281 0.0036
quadrupole: 8.7287 0.1933 -8.9220 9.3958 0.0281 0.0036
hfenergy: -974.189536 hartree
pointgroup: C01 [X(C8H8Cl1N1O2)]
dipole: -2.5681145 0.7351581 0.0524889 debye
dipolederiv: -0.2242757 0.2560188 0.0165187 0.3028287 -0.5920638 -0.0350115 0.0194255 -0.0349769 -0.0468594 -0.5312204 -0.3625053 -0.0222127 -0.6464205 -1.2040071 -0.046544 -0.0398073 -0.0469485 -0.4436266 -1.2739137 0.1767083 0.0119067 0.2471103 -0.6257271 -0.0189649 0.0161295 -0.0188032 -0.3241386 -1.8188711 0.0941913 0.008241 -0.2123609 -0.2667367 0.0131114 -0.0140886 0.0121795 -0.4816961 1.8505847 0.0673597 0.001145 0.3171762 0.1956133 0.001229 0.0167803 0.0018774 0.1636772 -1.3471696 -0.077508 -0.0028716 -0.1087932 -0.4896307 -0.0300369 -0.0052664 -0.0302171 -0.0095694 -0.8687554 0.1043795 0.0078641 0.4808142 -0.1769725 -0.0000996 0.0316412 0.0005332 -0.191325 -0.6074945 -0.0505179 -0.0023603 -0.5822986 -0.0800938 0.0116568 -0.0352835 0.0103915 -0.250594 0.9307196 -0.3044482 -0.020959 -0.0250674 1.0238046 0.0669676 -0.0036191 0.0674484 -0.0318988 0.6725481 -0.1095308 -0.0079693 -0.1874584 0.0544963 0.0089639 -0.0126431 0.0090498 -0.0861753 0.5084062 -0.1429708 -0.0097475 -0.4557379 0.3582127 0.0066386 -0.0285477 0.0057869 0.280547 2.3001611 0.3284037 0.0182398 0.3692138 1.4329152 0.0740244 0.0209903 0.0741866 0.2337772 0.0296785 -0.0653831 -0.0038338 -0.0615466 -0.0252416 -0.0122284 -0.0033656 -0.0122419 0.172145 -0.0033163 0.0929469 0.005951 0.0956508 -0.0159982 -0.0117952 0.0061623 -0.0116346 0.1705723 0.1215763 -0.0162591 -0.0009597 -0.0240489 0.0012273 -0.0095306 -0.0014754 -0.0095239 0.1541344 0.1537349 0.0491075 0.0036666 0.1338911 0.0962718 -0.0148 0.0098053 -0.01413 0.3302164 0.0505705 -0.0183982 -0.0526425 0.160042 -0.0202279 -0.1005329 0.0593271 -0.1120847 -0.0959023 -0.1416228 -0.0407382 -0.0019744 -0.1241483 0.0464112 -0.0051375 -0.0071566 -0.0053474 0.1293782 0.0511217 -0.0244125 0.0491849 0.1660485 -0.0483401 0.105879 -0.0386736 0.1181876 -0.0674002 0.1475378 0.0435565 0.0028129 0.1551051 0.336087 -0.0037891 0.0096655 -0.0037327 0.394738 unknown
polarizability: 189.7951241|-6.1699177|119.5806825|-0.6134311|4.464866|48.6504948 unknown
InChI: InChI=1S/C8H8ClNO2/c1-10-5-2-3-6(8(11)12)7(9)4-5/h2-4,10-11H,1H3
charge 0 multiplicity 1
20 atoms
Cl 1.432082 -2.631137 -0.112485
O  2.761957 1.830377 0.165849
O  3.419627 -0.387029 0.027877
N  -3.209434 -0.399365 0.035689
C  -1.839889 -0.187211 0.046211
C  1.022928 0.186247 0.065435
C  -0.950628 -1.303078 -0.024894
C  -1.27534 1.123395 0.126606
C  0.435651 -1.111697 -0.015066
C  0.114501 1.285133 0.134937
C  -4.203574 0.671315 0.107467
C  2.478733 0.440926 0.07997
H  -1.350502 -2.320729 -0.087712
H  -1.921344 2.003693 0.181854
H  0.546063 2.28718 0.196837
H  -3.540521 -1.361091 -0.022278
H  -4.110735 1.25592 1.044045
H  -5.21276 0.229642 0.081578
H  -4.115661 1.371667 -0.746567
H  3.751146 1.928844 0.171442
