program: Gaussian 09
title: 000287283
version: EM64L-G09RevD.01
frameworkgroup: C1[X(C5H6N2O2)]
method: RPBEPBE
basis: SDD
operation: Freq
keyword: #pfreq=noraman
keyword: PBEPBE/SDD
title: #p freq=noraman PBEPBE/SDD
converged: NO NO NO NO
title: Mulliken charges:
elementType: O O N N C C C C C H H H H H H
charge: -0.306432 -0.255426 0.016502 -0.333437 0.426639 -0.299930 -0.747267 -0.297334 0.168231 0.261038 0.260612 0.260638 0.211764 0.289317 0.345085
chargesum: 0.00000
title: Mulliken charges with hydrogens summed into heavy atoms:
elementType: O O N N C C C C C
charge: -0.306432 -0.255426 0.016502 0.011648 0.426639 -0.038892 -0.014253 -0.008018 0.168231
polarizability: 1.16743283e+02 -3.87358693e+00 8.32738593e+01 9.97249657e-04 1.46122617e-03 3.47046033e+01
1716.lowfreq: -0.0006 -0.0003 0.0006 2.9047 6.8232 13.7489 114.0622 158.0492 193.0037
frequency: 114.0525 158.0402 192.9992 296.9910 302.5375 369.1249 423.3892 444.7806 524.1373 568.6304 629.6355 680.4984 719.6804 728.9643 751.1736 808.4014 868.1718 897.3746 993.4498 1050.9005 1154.2158 1204.0696 1228.9032 1236.1250 1322.4189 1341.8559 1399.7503 1413.1390 1437.8646 1442.5024 1469.5401 1630.6839 1673.9923 2994.8875 3076.9672 3105.4479 3185.4632 3230.3278 3533.6623
redmass: 4.7812 1.0333 6.7940 3.9706 2.9794 11.4986 2.9087 6.5998 7.4251 5.3460 1.8753 3.5061 2.0000 6.2086 5.5425 1.6550 1.3265 3.1190 1.5714 1.4405 1.9540 9.8673 1.7749 2.9383 1.9934 2.8317 2.1507 1.4819 3.5168 1.0433 1.0884 4.9589 6.9317 1.0362 1.0976 1.1004 1.0948 1.0930 1.0785
irintensity: 0.7413 0.1914 2.4370 4.7116 1.8286 13.9678 12.8991 16.8412 3.7175 0.6479 56.0194 0.3131 66.8041 11.2742 0.8972 49.3548 15.0466 6.3784 5.0088 6.6888 18.7050 116.5720 8.9625 9.5595 12.9969 33.2520 37.8890 14.0432 11.7453 14.7423 12.3294 439.5363 155.1570 13.9744 8.8684 12.0082 2.4659 4.2916 76.1001
temp: 298.150 k
press: 1.00000 atm
elementType: 8 8 7 7 6 6 6 6 6 1 1 1 1 1 1
symmnumber: 1
zpe: 290721.0 jmol-1
zpe.correction: 0.110730 hartree
zpe.thermalcorrener: 0.118542 hartree
zpe.thermalcorrenthalpy: 0.119486 hartree
zpe.thermalcorrgfe: 0.078454 hartree
zpe.sumelectzpe: -453.372637 hartree
zpe.sumelectthermal: -453.364825 hartree
zpe.sumelectthermalent: -453.363881 hartree
zpe.sumelectthermalfe: -453.404913 hartree
dipole: -2.2800 -5.1844 -0.0014
dipole: 5.6636
quadrupole: -64.1331 -46.8310 -53.0184
quadrupole: 1.3217 -0.0035 -0.0026
quadrupole: -9.4722 7.8298 1.6425 1.3217 -0.0035 -0.0026
hfenergy: -453.483367 hartree
pointgroup: C01 [X(C5H6N2O2)]
dipole: -0.904264 2.0365115 0.0008779 debye
dipolederiv: -0.7835631 -0.1747252 -0.0000815 -0.4300688 -0.6228082 -0.0000908 -0.0004807 -0.0001331 -0.2912732 -1.4537282 0.151783 -0.0005219 0.0709766 -0.422791 0.0001381 0.0012615 -0.0001294 -0.3855642 0.9595392 0.1231539 0.0002902 0.2609897 0.8157879 0.0000687 0.0002373 0.000083 0.1710305 -0.7957374 -0.2946924 0.0001069 0.489374 -0.4703994 -0.0002143 -0.0000564 0.0001927 -0.2791126 0.2834548 -0.2276262 -0.0000415 -0.0682513 -0.5470806 -0.0000852 0.0002174 0.000018 -0.0688716 0.5072667 0.5647409 0.0000794 -0.0312011 0.2101171 -0.0000304 0.0000255 0.000077 -0.0543732 -0.1361034 0.0345847 -0.0000479 -0.0726048 0.1028514 -0.0000025 -0.0000286 -0.0000215 0.0558356 -0.8737433 -0.0701395 -0.0001434 -0.2287729 -0.0132435 0.0001856 -0.0001941 0.0001342 -0.2032465 1.8313606 -0.1694717 0.0003918 -0.1255468 0.6339843 0.0000147 -0.0008008 -0.0001279 0.2394522 0.0788612 0.0456472 -0.0000058 0.0492209 -0.0099443 0.0000357 -0.0001145 -0.0000556 0.1808006 0.0259959 0.0044327 0.0451786 -0.0300424 0.0801715 0.078321 0.0738028 0.0476304 -0.014757 0.0260732 0.0044607 -0.0451332 -0.0300481 0.0801788 -0.0783184 -0.0737869 -0.047611 -0.0147515 0.0833308 -0.0139971 0.0000016 0.0964657 -0.1226688 0.0000116 -0.0000048 0.0000099 0.1203134 0.0653865 -0.0100681 -0.0000479 -0.0143934 0.0633255 -0.000081 -0.0000298 -0.0001096 0.1971797 0.1816064 0.0319171 -0.0000254 0.0639028 0.2225192 0.000047 -0.0000479 0.000043 0.3473379 unknown
polarizability: 116.7153349|3.9924061|83.3018053|0.0035182|0.0108941|34.7046058 unknown
InChI: InChI=1S/C5H6N2O2/c1-4-2-6-5(8)3-7(4)9/h2-3,6H,1H3
charge 0 multiplicity 1
15 atoms
O  -1.622705 -1.762075 -0.00064
O  2.921651 -0.30178 -0.00056
N  -0.704247 -0.81081 0.000037
N  1.158046 1.25298 0.000404
C  -1.155202 0.560873 0.000178
C  -0.190908 1.545061 0.000222
C  -2.639611 0.773802 -0.000046
C  0.635224 -1.09817 0.000125
C  1.670775 -0.086649 0.001048
H  -0.478747 2.59806 0.000042
H  -3.104936 0.303498 0.88413
H  -3.104678 0.303477 -0.884347
H  -2.871242 1.852159 -0.000098
H  0.905463 -2.153298 -0.000554
H  1.86282 1.99557 0.00026
