program: Gaussian 09
title: 000287296
version: EM64L-G09RevD.01
frameworkgroup: C1[X(C12H14N4O2)]
method: RPBEPBE
basis: SDD
operation: Freq
keyword: #p
keyword: freq=noraman
keyword: PBEPBE/SDD
title: #p freq=noraman PBEPBE/SDD
converged: YES YES NO NO
title: Mulliken charges:
elementType: O O N N N N C C C C C C C C C C C C H H H H H H H H H H H H H H
charge: -0.259095 -0.187612 -0.301425 -0.067993 -0.601559 -0.521128 -0.342415 0.556227 -0.000980 0.207232 0.323607 -0.373330 -0.408528 -0.235270 -0.228431 -0.244937 -0.249482 -0.673668 0.277418 0.239258 0.235040 0.224906 0.225830 0.420738 0.336881 0.228444 0.218613 0.227349 0.278680 0.213390 0.247865 0.234375
chargesum: 0.00000
title: Mulliken charges with hydrogens summed into heavy atoms:
elementType: O O N N N N C C C C C C C C C C C C
charge: -0.259095 -0.187612 -0.301425 -0.067993 0.156060 -0.242449 -0.064997 0.556227 -0.000980 0.207232 0.323607 -0.134071 -0.173488 -0.010364 -0.002601 -0.016493 0.196480 0.021961
polarizability: 1.95208382e+02 4.79305684e+00 1.57214207e+02 -2.00871532e+01 9.70275070e+00 1.37074971e+02
1716.lowfreq: -4.1502 -0.0003 0.0004 0.0004 3.3282 8.0072 22.9717 29.4135 54.8039
frequency: 22.7997 29.3993 54.7796 66.3857 90.1236 98.4582 111.1702 128.3148 195.1759 228.8690 233.3346 244.9709 264.3503 296.8570 336.1472 383.9407 402.8380 428.3864 445.1301 491.8233 530.1295 584.9968 608.2322 615.0003 634.5875 654.6493 666.7317 676.3692 702.6138 707.2436 719.3443 756.7189 821.1238 826.3827 827.1054 850.1909 850.8467 856.9533 873.9295 924.2737 975.6525 989.1704 992.0657 995.3746 1026.4194 1043.6213 1064.0731 1083.2407 1094.5168 1118.7234 1135.2246 1167.1471 1172.9970 1179.0753 1184.3455 1189.2493 1229.4617 1261.0864 1286.9810 1312.4504 1337.0700 1376.8951 1386.5641 1403.1259 1409.9751 1444.0134 1461.6489 1477.7368 1484.5198 1488.1588 1513.6934 1596.8614 1608.8424 1615.9724 1630.7741 1693.5855 2969.9280 3002.0224 3033.4371 3047.1297 3099.4294 3114.5991 3120.8413 3125.5176 3137.1799 3147.4590 3164.1842 3165.2273 3473.0999 3636.0680
redmass: 3.9368 4.0028 3.8859 4.1907 3.0807 4.5701 4.9706 4.3077 8.7524 4.5660 4.9547 1.2289 4.1397 3.8860 5.2369 3.9363 2.8161 5.2390 5.8480 3.5500 5.1265 1.2153 5.1628 6.2586 8.7329 2.0630 2.7106 3.8286 1.9668 3.6595 4.4607 2.1936 4.4873 2.2060 1.4154 3.4921 1.3105 3.4776 1.1263 1.5695 1.3882 4.6380 2.2326 1.4087 2.2358 3.0407 3.2399 1.7364 2.4150 2.2790 1.4338 2.4814 1.0676 4.1033 1.5676 1.1190 3.1624 1.1454 1.4526 2.3224 1.2999 1.9503 5.3991 1.3244 2.4627 2.1621 1.0389 1.0582 2.3068 1.0844 1.8266 6.1284 4.1324 4.7604 5.9379 11.3700 1.0554 1.0365 1.1082 1.0849 1.0990 1.1019 1.0850 1.0873 1.0919 1.0964 1.0998 1.0704 1.0772 1.0865
irintensity: 0.5964 0.0738 2.9263 0.9213 0.4735 2.2532 1.0304 1.8958 0.6088 2.8744 3.3691 1.4696 7.9430 1.4879 10.4104 19.4039 0.3102 5.2815 4.6387 10.6388 20.4124 105.1417 4.8961 0.9118 4.6048 60.1392 74.2317 13.5972 53.4830 20.1603 17.2019 28.7795 7.6926 20.2352 13.9648 19.5348 0.6737 19.4310 122.7029 1.6426 0.0163 4.3528 29.7515 0.1594 5.8087 202.1063 230.1448 5.6656 43.2110 0.9570 6.3518 197.9589 3.3523 38.0163 23.9103 1.7641 13.8488 0.1751 21.6437 200.3546 5.0046 14.1680 39.7638 58.4800 274.7563 31.8300 12.8676 11.8543 21.9623 7.4527 159.9669 2.9767 325.6071 153.6379 838.0708 82.2546 31.5141 15.2146 23.7957 8.2703 23.6448 25.7522 4.6287 0.2527 14.9666 36.5117 40.4006 312.9516 17.4308 115.6575
temp: 298.150 k
press: 1.00000 atm
elementType: 8 8 7 7 7 7 6 6 6 6 6 6 6 6 6 6 6 6 1 1 1 1 1 1 1 1 1 1 1 1 1 1
symmnumber: 1
zpe: 657390.5 jmol-1
zpe.correction: 0.250387 hartree
zpe.thermalcorrener: 0.266984 hartree
zpe.thermalcorrenthalpy: 0.267928 hartree
zpe.thermalcorrgfe: 0.204432 hartree
zpe.sumelectzpe: -833.824915 hartree
zpe.sumelectthermal: -833.808318 hartree
zpe.sumelectthermalent: -833.807374 hartree
zpe.sumelectthermalfe: -833.870870 hartree
dipole: -1.8411 8.9131 2.0581
dipole: 9.3311
quadrupole: -91.4250 -114.0076 -101.7646
quadrupole: -0.6784 -2.6482 -9.2028
quadrupole: 10.9741 -11.6085 0.6345 -0.6784 -2.6482 -9.2028
hfenergy: -834.0753017 hartree
pointgroup: C01 [X(C12H14N4O2)]
dipole: 0.668026 3.5709434 0.5284176 debye
polarizability: 192.4750044|-10.6507256|161.654186|-15.4128631|14.9683102|135.3683694 unknown
InChI: InChI=1S/C12H14N4O2/c1-2-18-12(14)16-9(10(17)15-11(16)13)8-6-4-3-5-7-8/h3-7,9,14H,2,13H2,1H3
charge 0 multiplicity 1
32 atoms
O  -0.003374 2.075196 -0.666761
O  -0.90418 -3.036249 -1.254711
N  -1.316628 0.303277 -0.077966
N  -2.443966 -1.734292 0.029276
N  -3.42199 0.198036 1.066139
N  -1.960212 2.408391 0.763768
C  -0.396073 -0.635846 -0.757927
C  0.953379 -0.805446 -0.077946
C  -1.263361 -1.969414 -0.70809
C  -2.453135 -0.432643 0.367846
C  -1.132483 1.677482 0.052813
C  1.089723 -0.699888 1.328203
C  2.084047 -1.140531 -0.860057
C  2.342733 -0.917834 1.940798
C  3.336817 -1.364009 -0.247185
C  3.471653 -1.250076 1.155713
C  0.43592 3.487971 -0.518767
C  1.738316 3.620238 -1.30137
H  -0.256459 -0.352585 -1.815453
H  0.218037 -0.451558 1.945485
H  1.980942 -1.23745 -1.947151
H  2.437631 -0.836561 3.029578
H  4.204463 -1.627966 -0.862154
H  -3.271307 1.214133 1.247356
H  -4.232111 -0.342018 1.361314
H  4.442985 -1.423353 1.632295
H  -0.35189 4.154703 -0.923498
H  0.582631 3.704365 0.557997
H  -1.781273 3.422192 0.778451
H  2.121857 4.653211 -1.218844
H  2.500105 2.928798 -0.904761
H  1.579402 3.391524 -2.368489
