program: Gaussian 09
title: 000287302
version: EM64L-G09RevD.01
frameworkgroup: C1[X(C10H12N6O5)]
method: RPBEPBE
basis: SDD
operation: Freq
keyword: #p
keyword: freq=noraman
keyword: PBEPBE/SDD
title: #p freq=noraman PBEPBE/SDD
converged: NO YES NO NO
title: Mulliken charges:
elementType: O O O O O N N N N N N C C C C C C C C C C H H H H H H H H H H H H
charge: -0.278031 -0.447911 -0.443819 -0.320564 -0.373998 -0.164927 -0.079113 -0.299942 -0.212855 -0.054131 -0.602215 -0.170709 -0.079438 -0.197972 -0.168683 0.239970 0.266317 -0.200628 -0.107307 0.174691 -0.306755 0.271350 0.251804 0.280258 0.293498 0.360752 0.277030 0.402101 0.360216 0.259442 0.341231 0.350914 0.379422
chargesum: 0.00000
title: Mulliken charges with hydrogens summed into heavy atoms:
elementType: O O O O O N N N N N N C C C C C C C C C C
charge: -0.278031 -0.087160 -0.041718 -0.320564 0.005424 -0.164927 -0.079113 0.060274 -0.212855 -0.054131 0.089930 0.100641 0.172366 0.082286 0.124816 0.239970 0.266317 0.076402 -0.107307 0.174691 -0.047312
polarizability: 2.37669780e+02 -2.42011837e+00 1.67373181e+02 1.44610803e+01 -4.21113352e+00 9.69212576e+01
1716.lowfreq: -11.6597 -2.0762 0.0005 0.0005 0.0007 7.4379 28.5452 44.1559 48.1033
frequency: 28.4614 44.1181 48.0729 62.8724 81.1783 121.4505 138.3194 170.2240 182.5693 207.7490 223.4735 247.3953 267.1184 281.4090 287.5047 302.1999 321.4748 337.5162 365.3610 398.6081 454.3460 467.5536 490.8948 512.9038 523.5774 539.6542 547.5336 557.9921 564.3448 596.0678 603.4596 648.0625 671.6707 686.8229 714.7624 757.7494 766.1347 793.1378 812.9014 827.3844 867.0243 875.1023 903.1694 922.9912 927.0224 939.6050 951.6960 963.5747 988.8030 1007.1153 1027.4673 1035.7880 1058.1945 1064.7816 1141.1821 1163.7617 1183.3636 1194.0724 1210.7558 1226.0428 1232.7547 1254.5800 1259.7360 1283.2280 1292.6088 1303.8499 1328.1806 1332.3964 1339.6499 1366.0016 1374.0792 1392.5138 1403.7119 1439.8034 1473.1407 1496.2399 1538.2202 1560.2887 1566.7763 1583.7045 1638.8677 2710.5651 3022.0921 3038.9345 3052.1175 3067.2887 3176.5771 3232.1517 3268.9175 3535.3487 3579.3855 3614.9250 3688.9524
redmass: 7.5270 7.0483 7.2146 8.7243 5.4585 7.3376 5.8101 6.9668 7.6177 6.5085 5.7970 7.0369 6.0454 5.4444 6.2641 4.6106 1.3650 4.7070 6.0611 4.2931 1.4002 5.1140 6.6039 1.2208 8.8547 5.0731 1.3331 1.1097 2.9567 3.3975 3.6513 4.2495 8.3983 7.1504 6.7660 5.8963 7.0663 4.5911 6.4648 1.7599 5.3111 7.9574 4.1067 3.0077 1.5430 2.7688 1.3635 2.4704 4.3903 5.3753 4.9915 3.9820 3.2783 3.2599 1.5520 2.8404 2.0068 1.4105 1.5506 1.3223 2.2627 1.6450 1.8108 1.2341 1.3777 5.3497 1.4112 3.0622 1.5964 2.1457 1.7860 2.1593 3.0865 3.0291 3.6525 1.7814 1.3360 4.7501 4.8245 1.8146 2.9100 1.0795 1.0869 1.0856 1.0868 1.0860 1.0931 1.0989 1.0638 1.0446 1.0662 1.0823 1.1056
irintensity: 0.0663 2.4917 2.6779 0.8235 2.0466 1.7056 3.0299 2.6853 1.0443 2.9372 6.6445 8.4907 16.5215 37.3747 17.8916 49.2289 121.3414 19.1342 9.0985 8.7803 29.2190 17.4986 0.0927 211.0436 8.3932 6.6327 229.8811 2.6273 27.7135 13.4073 3.4413 50.8057 8.5748 22.8576 29.8138 25.7809 29.4934 12.2371 102.8271 14.2280 18.6536 6.8318 16.2274 26.0963 80.1788 62.7518 43.5565 1.0464 190.5138 61.0630 32.6077 69.5226 15.7747 34.3258 11.9250 31.3347 68.3619 93.7540 10.5375 10.9435 48.7667 35.5546 31.2382 13.9127 8.1918 28.6422 5.1896 21.9720 80.5845 148.4488 71.0412 34.8557 3.4388 62.0160 19.6402 34.1109 12.7846 24.8159 194.9731 39.3139 700.2519 1839.7816 36.5587 8.0422 6.4593 3.5067 6.0057 0.4036 21.4493 153.3330 16.6120 76.2025 55.8318
temp: 298.150 k
press: 1.00000 atm
elementType: 8 8 8 8 8 7 7 7 7 7 7 6 6 6 6 6 6 6 6 6 6 1 1 1 1 1 1 1 1 1 1 1 1
symmnumber: 1
zpe: 632544.2 jmol-1
zpe.correction: 0.240923 hartree
zpe.thermalcorrener: 0.259214 hartree
zpe.thermalcorrenthalpy: 0.260159 hartree
zpe.thermalcorrgfe: 0.193983 hartree
zpe.sumelectzpe: -1091.298206 hartree
zpe.sumelectthermal: -1091.279915 hartree
zpe.sumelectthermalent: -1091.278971 hartree
zpe.sumelectthermalfe: -1091.345147 hartree
dipole: -4.5927 -2.9706 0.9160
dipole: 5.5458
quadrupole: -115.4265 -129.7647 -119.0829
quadrupole: 2.3271 5.2470 1.1307
quadrupole: 5.9982 -8.3400 2.3418 2.3271 5.2470 1.1307
hfenergy: -1091.5391296 hartree
pointgroup: C01 [X(C10H12N6O5)]
dipole: -1.9611762 0.5355539 0.7922304 debye
polarizability: 235.7604785|9.4188273|98.3830127|13.1969429|14.2845885|167.8207272 unknown
InChI: InChI=1S/C10H12N6O5/c11-7-3-8(13-1-12-7)16(2-14-3)10-5(18)4(17)6(21-10)9(19)15-20/h1-2,4-6,10,15,17-18,20H,11H2
charge 0 multiplicity 1
33 atoms
O  1.083485 -0.752415 0.761813
O  2.237416 2.232776 0.45809
O  1.095898 0.030804 -2.354711
O  4.635021 -0.38326 -0.158178
O  4.801298 -0.933099 2.468175
N  -0.922233 0.557343 0.777666
N  -3.07755 0.599755 1.584656
N  3.552869 -0.999155 1.764142
N  -1.407475 -0.258125 -1.53439
N  -3.795089 -0.632049 -1.91509
N  -5.423966 -0.246751 -0.250557
C  1.24494 1.4441 -0.286534
C  0.538431 0.625233 0.829692
C  1.91085 0.389482 -1.22834
C  2.17788 -0.787934 -0.252418
C  3.542213 -0.688138 0.437558
C  -1.743976 0.124971 -0.269617
C  -1.784572 0.815002 1.865716
C  -3.065743 0.162768 0.246076
C  -4.114736 -0.2382 -0.633176
C  -2.488293 -0.61988 -2.292572
H  0.552157 2.094665 -0.85304
H  0.805836 1.076367 1.802352
H  2.868358 0.759211 -1.635455
H  2.092862 -1.748868 -0.786977
H  2.912644 2.596478 -0.168328
H  -1.401087 1.160812 2.823681
H  0.116218 -0.151543 -2.065917
H  2.750056 -1.213127 2.353612
H  -2.275972 -0.93419 -3.317842
H  -6.13271 -0.544868 -0.918422
H  -5.68012 0.038042 0.692963
H  5.43259 -0.683407 1.71807
