program: Gaussian 09
title: 000287274
version: EM64L-G09RevD.01
frameworkgroup: C1[X(C12H15N3)]
method: RPBEPBE
basis: SDD
operation: Freq
keyword: #pfreq=noraman
keyword: PBEPBE/SDD
title: #p freq=noraman PBEPBE/SDD
converged: YES YES NO NO
title: Mulliken charges:
elementType: N N N C C C C C C C C C C C C H H H H H H H H H H H H H H H
charge: -0.046501 -0.035399 -0.018272 0.271121 -0.459642 -0.459266 -0.407734 -0.407087 0.110804 -0.615456 -0.281465 -0.327320 -0.184492 -0.373757 -0.181341 0.212662 0.261241 0.259968 0.212892 0.217873 0.204810 0.204805 0.217887 0.223616 0.191484 0.223731 0.264734 0.241756 0.243905 0.234446
chargesum: 0.00000
title: Mulliken charges with hydrogens summed into heavy atoms:
elementType: N N N C C C C C C C C C C C C
charge: -0.046501 -0.035399 -0.018272 0.271121 0.014260 0.013594 0.014949 0.015605 0.110804 0.023375 -0.281465 -0.062587 0.057264 -0.129852 0.053105
polarizability: 1.80042473e+02 3.86832036e+00 1.41960684e+02 -1.52776858e-01 1.81813303e-01 9.62958382e+01
1716.lowfreq: -3.6011 -0.0007 -0.0006 -0.0004 9.4542 9.5581 39.7143 65.1353 94.4945
frequency: 39.6002 65.1177 94.4204 125.7853 139.7810 174.0306 223.5503 244.8626 255.9702 273.1974 287.1239 350.9707 356.0352 402.4585 405.6327 458.1974 460.7944 531.7238 547.2682 574.6409 614.7713 649.4936 693.3684 743.5080 753.3679 788.1971 815.3579 906.4038 912.6684 926.1271 929.1889 962.1751 963.5580 997.9658 1006.1099 1024.9629 1042.1245 1054.0070 1060.1899 1084.0030 1099.7489 1111.2301 1134.8485 1152.5307 1170.5198 1182.9711 1195.0182 1223.6804 1278.2263 1283.6338 1292.8471 1300.2743 1313.1260 1316.4648 1337.8010 1354.0397 1379.1464 1411.4255 1432.3473 1448.6442 1449.0845 1460.0617 1462.9268 1465.1436 1479.6848 1482.4350 1566.3498 1580.0484 2179.7942 2833.3504 2840.3653 2862.9199 3007.5354 3008.8849 3018.8166 3023.9164 3028.7685 3076.7039 3081.8217 3085.7281 3129.1427 3142.4236 3160.6484 3173.6383
redmass: 4.7686 3.7101 3.5772 9.2362 3.6512 3.6037 1.1692 2.8832 5.6163 2.3888 2.9522 2.2520 2.1115 3.0614 3.4794 7.8496 3.1672 3.1207 3.0857 4.7684 7.4326 3.3173 6.2228 3.0200 1.7818 2.2366 1.5421 1.3492 4.1667 2.0298 2.4223 5.9418 1.4581 2.5884 1.3377 1.6261 2.5011 2.2697 1.7417 1.7137 1.4430 4.0476 2.1184 2.4606 1.0860 1.0852 1.8030 3.8473 1.4394 1.7985 1.4340 1.6328 1.3444 7.9591 1.3768 1.3243 1.3903 1.9333 1.1855 1.1015 2.0247 1.0973 1.0549 1.0730 1.1018 1.0557 5.7652 5.7471 12.6351 1.0721 1.0683 1.0580 1.0631 1.0643 1.0731 1.0834 1.0854 1.1010 1.1032 1.1026 1.0886 1.0894 1.0942 1.1015
irintensity: 4.0503 1.6721 0.0617 5.9138 1.8098 1.4142 0.3037 1.9700 0.2734 0.1091 9.5933 1.0716 4.0379 0.2635 4.2489 1.5086 1.8708 6.0702 1.5020 4.4341 1.3261 3.1664 2.9637 7.3537 34.6668 35.7890 0.0006 0.0145 6.0167 0.7670 1.8226 1.7332 0.9118 35.0928 0.1745 6.0223 4.7288 2.8924 10.6435 5.4779 15.9385 6.0497 17.9272 8.1339 0.3798 5.3835 0.1431 13.3568 2.0284 17.0706 2.4805 2.2209 0.1699 1.7984 6.5713 1.3677 16.0750 22.5131 4.4390 9.6186 47.6573 22.8869 22.2890 0.2008 14.8565 8.7871 11.6445 57.0006 9.6758 41.4632 65.0503 191.6493 8.7648 15.8768 45.5023 74.4437 19.7204 32.2590 9.2670 12.6117 13.1354 9.0839 13.7653 20.5162
temp: 298.150 k
press: 1.00000 atm
elementType: 7 7 7 6 6 6 6 6 6 6 6 6 6 6 6 1 1 1 1 1 1 1 1 1 1 1 1 1 1 1
symmnumber: 1
zpe: 651710.1 jmol-1
zpe.correction: 0.248223 hartree
zpe.thermalcorrener: 0.261778 hartree
zpe.thermalcorrenthalpy: 0.262722 hartree
zpe.thermalcorrgfe: 0.208046 hartree
zpe.sumelectzpe: -629.389940 hartree
zpe.sumelectthermal: -629.376385 hartree
zpe.sumelectthermalent: -629.375441 hartree
zpe.sumelectthermalfe: -629.430117 hartree
dipole: -1.7936 -1.8841 0.0517
dipole: 2.6019
quadrupole: -69.8629 -102.6795 -87.6974
quadrupole: -1.9819 -0.0411 0.2260
quadrupole: 16.8837 -15.9329 -0.9508 -1.9819 -0.0411 0.2260
hfenergy: -629.6381629 hartree
pointgroup: C01 [X(C12H15N3)]
dipole: 0.7184528 -0.7230371 -0.0943921 debye
polarizability: 180.1522017|-3.0718948|141.4935606|-1.4488753|3.9302941|96.6532324 unknown
InChI: InChI=1S/C12H15N3/c1-15-8-5-12(10-13,6-9-15)11-4-2-3-7-14-11/h2-4,7H,5-6,8-9H2,1H3
charge 0 multiplicity 1
30 atoms
N  -3.016534 -0.843563 -0.171942
N  1.569593 -1.294666 -0.249907
N  -0.731719 2.939075 0.178492
C  -0.267333 0.318145 -0.087142
C  -0.921909 -0.446709 1.117678
C  -0.95102 -0.195874 -1.40438
C  -2.457037 -0.33673 1.102656
C  -2.484807 -0.091955 -1.332702
C  1.249119 0.031202 -0.134645
C  -4.491909 -0.879235 -0.158057
C  -0.516158 1.771053 0.059859
C  2.238796 1.041674 -0.068582
C  3.601039 0.668529 -0.121482
C  2.885161 -1.64086 -0.299847
C  3.937256 -0.697999 -0.238784
H  -0.524976 -0.055976 2.072859
H  -0.617657 -1.502877 1.017047
H  -0.649465 -1.251449 -1.51966
H  -0.573486 0.375251 -2.272598
H  -2.867626 -0.944738 1.930532
H  -2.761674 0.726524 1.29139
H  -2.788606 0.987696 -1.298427
H  -2.917099 -0.522648 -2.255329
H  -4.861847 -1.327167 -1.09781
H  -4.95929 0.132362 -0.049192
H  -4.840635 -1.508545 0.680419
H  1.949402 2.092835 0.023022
H  4.383457 1.433086 -0.071414
H  3.094534 -2.712946 -0.39162
H  4.979726 -1.027995 -0.282133
