program: Gaussian 09
title: 000287272
version: EM64L-G09RevD.01
frameworkgroup: C1[X(C14H10ClNO5)]
method: RPBEPBE
basis: SDD
operation: Freq
keyword: #p
keyword: freq=noraman
keyword: PBEPBE/SDD
title: #p freq=noraman PBEPBE/SDD
converged: YES YES NO NO
title: Mulliken charges:
elementType: Cl O O O O O N C C C C C C C C C C C C C C H H H H H H H H H H
charge: -0.002011 -0.259074 -0.444978 -0.244060 -0.208913 -0.207300 0.021213 0.395481 -0.401109 -0.469406 0.534375 -0.392678 0.251321 -0.200795 -0.352521 -0.308435 -0.286545 0.405628 -0.358854 -0.387336 0.103881 0.238327 0.237852 0.273850 0.286478 0.239507 0.268490 0.276277 0.312849 0.290495 0.387991
chargesum: 0.00000
title: Mulliken charges with hydrogens summed into heavy atoms:
elementType: Cl O O O O O N C C C C C C C C C C C C C C
charge: -0.002011 -0.259074 -0.056987 -0.244060 -0.208913 -0.207300 0.021213 0.395481 0.075070 -0.195555 0.534375 -0.106201 0.251321 0.038711 -0.076243 -0.308435 -0.018055 0.405628 -0.046005 -0.096841 0.103881
polarizability: 3.20836320e+02 -1.05659299e+01 2.09183394e+02 1.50733523e+00 5.12664573e-01 7.33003001e+01
1716.lowfreq: -5.4489 -0.0017 -0.0010 0.0014 2.5610 5.9650 8.4700 21.8710 41.1004
frequency: 8.2907 21.7576 41.0949 57.2668 63.8877 90.3784 123.8629 124.9957 144.5589 152.6932 170.0392 183.3177 219.8989 231.4289 318.3679 321.0078 349.8386 372.2556 400.4117 414.2612 446.3488 478.8739 482.9550 509.9508 534.2654 552.2302 580.5797 598.9391 603.0393 638.4995 685.6532 689.5517 691.4245 722.8316 726.8021 729.8908 780.0105 820.3244 828.4771 852.0021 881.8229 917.4132 922.4350 964.0272 971.7712 988.2921 989.7377 1008.7740 1015.3801 1023.4628 1033.6278 1100.1426 1104.4225 1137.7201 1143.7011 1183.4515 1210.7650 1213.4231 1225.2614 1247.9500 1266.4772 1303.2880 1324.4559 1345.3860 1357.5927 1397.2425 1398.9759 1417.4954 1434.5496 1458.7592 1478.4921 1481.7082 1579.0854 1598.2348 1603.0814 1616.1980 1648.8030 2952.5585 3011.6554 3145.7616 3148.9401 3166.1202 3168.3453 3180.6008 3188.1011 3190.2208 3532.2302
redmass: 6.5563 7.7085 9.3483 12.1816 11.8849 4.5433 8.0385 6.6114 9.8458 4.5470 5.3717 10.7116 3.2763 5.8030 8.0338 7.7217 10.8397 9.2655 8.5915 2.9080 3.3067 4.0434 5.4917 6.5374 4.6155 5.1798 5.6034 1.2932 4.8430 7.5745 5.1255 3.6674 6.9486 6.1786 2.6397 4.3472 7.6415 1.5422 1.5384 8.1352 4.5842 1.3547 1.4100 1.3994 1.3491 8.0369 6.1990 1.4240 3.2926 1.6504 2.6833 1.5900 3.5908 1.4521 1.2696 1.1043 6.0351 1.0801 2.1186 2.3370 1.9811 1.3785 2.9305 1.7388 5.9563 9.2685 5.5267 5.4456 2.9213 1.3376 2.3189 2.1969 8.0487 6.5034 7.1720 6.4171 8.5157 1.0555 1.1060 1.0877 1.0921 1.0942 1.0888 1.0972 1.0931 1.0960 1.0642
irintensity: 0.7491 2.1063 1.1349 0.6786 0.0505 0.1566 4.8112 5.3640 2.0556 1.8048 0.3400 1.2585 2.1618 1.1940 2.0970 0.8617 7.1249 2.2504 3.9219 11.0065 4.2386 1.5151 5.5344 1.8235 0.3950 0.9714 24.0035 131.4193 31.8988 13.9710 8.2479 13.5333 33.5110 14.8448 81.4005 7.2888 6.7600 13.9039 57.5652 20.3891 22.3536 6.8812 26.8662 2.6851 1.9385 72.0481 5.5052 0.9925 242.8428 3.8381 64.2425 15.0465 30.6360 136.4154 69.1870 17.1905 518.5323 8.6305 3.5491 369.2001 130.8272 7.7724 92.3647 12.6530 67.1010 60.9245 16.4708 29.2191 6.9903 120.7927 16.6251 49.9782 24.9596 140.4360 91.6282 30.2962 257.8263 16.6275 18.6971 5.0849 2.0740 2.8204 5.3642 5.4892 5.5213 9.2264 48.5555
temp: 298.150 k
press: 1.00000 atm
elementType: 17 8 8 8 8 8 7 6 6 6 6 6 6 6 6 6 6 6 6 6 6 1 1 1 1 1 1 1 1 1 1
symmnumber: 1
zpe: 564877.9 jmol-1
zpe.correction: 0.215151 hartree
zpe.thermalcorrener: 0.233710 hartree
zpe.thermalcorrenthalpy: 0.234654 hartree
zpe.thermalcorrgfe: 0.164420 hartree
zpe.sumelectzpe: -1428.852339 hartree
zpe.sumelectthermal: -1428.833779 hartree
zpe.sumelectthermalent: -1428.832835 hartree
zpe.sumelectthermalfe: -1428.903069 hartree
dipole: -4.0142 -1.7943 0.2239
dipole: 4.4027
quadrupole: -184.5386 -116.0804 -128.7902
quadrupole: 12.5586 0.2296 0.9086
quadrupole: -41.4022 27.0560 14.3462 12.5586 0.2296 0.9086
hfenergy: -1429.0674892 hartree
pointgroup: C01 [X(C14H10Cl1N1O5)]
dipole: -1.4575591 0.4071969 0.8426571 debye
polarizability: 321.3434463|-8.4388064|85.1582797|-3.4205857|37.9348693|196.8182877 unknown
InChI: InChI=1S/C14H10ClNO5/c15-12-7-11(16(19)20)4-5-13(12)21-8-9-2-1-3-10(6-9)14(17)18/h1-7,17H,8H2
charge 0 multiplicity 1
31 atoms
Cl 1.655919 -1.433124 -2.935197
O  0.271043 -0.495264 -0.517408
O  -5.128888 0.571553 2.828346
O  -6.791788 0.240377 1.241581
O  6.442813 -0.129102 1.131468
O  6.595098 -0.919398 -1.006073
N  5.914882 -0.517678 0.016971
C  -2.054056 -0.145669 0.079359
C  -0.618733 -0.041682 0.565728
C  -3.096292 0.09432 1.002795
C  1.637439 -0.471189 -0.311099
C  -2.368267 -0.457934 -1.265365
C  -4.447136 0.029528 0.583493
C  -3.719224 -0.525233 -1.680989
C  -4.76068 -0.281424 -0.765138
C  2.451388 -0.902856 -1.399514
C  2.269014 -0.053581 0.891513
C  4.44264 -0.500734 -0.092641
C  3.845226 -0.922311 -1.303959
C  3.670186 -0.067124 1.004385
C  -5.570969 0.277396 1.526304
H  -0.3666 1.007728 0.824397
H  -0.460746 -0.675242 1.462044
H  -2.882133 0.332125 2.050469
H  -1.556703 -0.651301 -1.971967
H  -3.953124 -0.769256 -2.722392
H  1.66898 0.282002 1.740927
H  -5.812274 -0.327266 -1.065858
H  4.473848 -1.251434 -2.134868
H  4.172401 0.25052 1.921431
H  -5.923068 0.725052 3.407055
