program: Gaussian 09
title: 000287271
version: EM64L-G09RevD.01
frameworkgroup: C1[X(C15H12ClNO5)]
method: RPBEPBE
basis: SDD
operation: Freq
keyword: #p
keyword: freq=noraman
keyword: PBEPBE/SDD
title: #p freq=noraman PBEPBE/SDD
converged: NO YES NO NO
title: Mulliken charges:
elementType: Cl O O O O O N C C C C C C C C C C C C C C C H H H H H H H H H H H H
charge: -0.002006 -0.258947 -0.292333 -0.248170 -0.209442 -0.207637 0.021121 0.390985 -0.404152 -0.473872 0.239107 -0.396811 0.535904 -0.352242 -0.203394 -0.308991 -0.286724 0.405509 -0.359471 -0.387967 0.162072 -0.499288 0.237120 0.237385 0.270465 0.286224 0.274596 0.237984 0.268858 0.312732 0.290215 0.244489 0.231577 0.245102
chargesum: 0.00000
title: Mulliken charges with hydrogens summed into heavy atoms:
elementType: Cl O O O O O N C C C C C C C C C C C C C C C
charge: -0.002006 -0.258947 -0.292333 -0.248170 -0.209442 -0.207637 0.021121 0.390985 0.070353 -0.203407 0.239107 -0.110587 0.535904 -0.077645 0.034590 -0.308991 -0.017866 0.405509 -0.046740 -0.097753 0.162072 0.221881
polarizability: 3.32397088e+02 -1.02214523e+01 2.27145874e+02 -3.71948771e-01 -8.11437689e-02 8.21468382e+01
1716.lowfreq: -6.2341 -0.0029 -0.0022 -0.0020 3.6357 4.5902 9.1629 21.9557 38.1027
frequency: 7.3969 21.7754 38.0842 50.0884 60.4088 86.3560 90.8416 101.3949 117.2237 125.9327 143.9477 168.7295 180.0504 199.8728 204.3502 224.1556 290.2979 321.2471 323.6532 343.5545 363.1994 395.5717 423.2188 447.1727 473.2347 493.7625 504.1858 534.2094 552.3034 586.1424 639.0642 658.9221 684.0489 687.0301 697.4931 723.1958 730.2201 747.2866 781.3183 820.6358 827.5356 851.9218 864.2482 917.6356 922.0554 937.0023 962.4381 971.6619 989.7870 991.4157 1009.0242 1024.5184 1033.2875 1064.3770 1102.4671 1103.8587 1115.9920 1143.4513 1149.0181 1182.2696 1191.0583 1210.7163 1217.3099 1247.6505 1259.1341 1278.1422 1302.8643 1346.2626 1358.0675 1396.7428 1398.4896 1417.4907 1424.0047 1435.6702 1451.9935 1459.7624 1464.0436 1478.3137 1482.2043 1579.2979 1597.1148 1603.5931 1612.6215 1632.7713 2952.7208 3005.6136 3010.3511 3107.5694 3144.3003 3147.6643 3149.1868 3165.5556 3171.1798 3179.9855 3187.9050 3191.0169
redmass: 6.2685 7.2081 7.6510 5.2216 11.0156 3.6437 1.2994 6.4189 3.0154 5.8731 10.5158 5.4537 9.8174 4.0298 6.1270 3.1093 5.0759 7.6838 7.9626 7.8188 8.2608 9.4024 2.9916 3.3206 7.8515 4.1193 7.0243 4.6029 5.1947 6.2355 7.6278 6.7517 4.1398 5.0848 9.5535 2.5597 4.3659 6.2954 7.3447 1.5329 1.5128 8.0288 5.4579 1.3514 1.4108 5.9294 1.3949 1.3487 6.2580 6.9464 1.3963 1.6645 2.6574 3.3687 1.6065 3.5839 1.2630 1.2661 1.4803 1.1099 1.9016 6.2273 1.0605 2.5819 1.9752 3.7978 1.3755 1.7679 5.6381 8.6707 5.4282 4.8842 1.3478 2.3122 1.0492 1.3636 1.0523 2.5402 1.9661 7.9746 6.5275 7.3062 6.9830 8.5277 1.0552 1.0296 1.1062 1.1045 1.0876 1.0919 1.1047 1.0941 1.0882 1.0971 1.0930 1.0964
irintensity: 0.3517 2.4051 0.8250 1.1756 0.0001 1.5274 0.8271 0.3957 3.4360 8.6809 2.0459 0.1918 1.9702 1.0709 1.2007 5.6686 14.0205 0.5515 3.6052 2.1079 5.4932 0.0895 1.5535 4.6451 2.6244 7.4694 0.9558 0.8156 0.8952 1.7884 13.3076 9.3642 6.0988 7.2240 61.6294 55.2344 8.7715 2.0234 2.6737 6.1704 65.9391 18.5741 14.8473 6.6021 27.2340 51.9077 1.9761 1.7120 0.8742 56.7346 0.0726 2.8077 54.9399 160.1589 12.5943 31.9498 0.0436 64.0939 59.2725 61.6927 152.9197 543.6808 1.0091 423.8547 130.4306 92.6789 4.9275 11.2790 63.0800 33.3461 49.0889 35.8307 26.2081 2.1597 14.2375 122.3032 10.8448 3.3210 57.0811 25.2654 135.8799 113.2420 56.3700 118.5294 16.1705 39.6232 19.0734 25.3419 6.2711 3.5971 13.1475 3.2502 4.8581 5.7944 6.7944 8.3107
temp: 298.150 k
press: 1.00000 atm
elementType: 17 8 8 8 8 8 7 6 6 6 6 6 6 6 6 6 6 6 6 6 6 6 1 1 1 1 1 1 1 1 1 1 1 1
symmnumber: 1
zpe: 636795.6 jmol-1
zpe.correction: 0.242543 hartree
zpe.thermalcorrener: 0.262928 hartree
zpe.thermalcorrenthalpy: 0.263873 hartree
zpe.thermalcorrgfe: 0.189153 hartree
zpe.sumelectzpe: -1468.064474 hartree
zpe.sumelectthermal: -1468.044089 hartree
zpe.sumelectthermalent: -1468.043144 hartree
zpe.sumelectthermalfe: -1468.117864 hartree
dipole: -4.7092 -2.2377 -0.0032
dipole: 5.2138
quadrupole: -186.4753 -122.6597 -134.8556
quadrupole: 20.7300 -0.0118 -0.1711
quadrupole: -38.4784 25.3371 13.1413 20.7300 -0.0118 -0.1711
hfenergy: -1468.307017 hartree
pointgroup: C01 [X(C15H12Cl1N1O5)]
dipole: -1.6511145 0.8809073 0.839951 debye
polarizability: 330.8929898|-21.460471|144.6123493|5.4483343|70.8511524|166.1844612 unknown
InChI: InChI=1S/C15H12ClNO5/c1-21-15(18)11-4-2-3-10(7-11)9-22-14-6-5-12(17(19)20)8-13(14)16/h2-8H,9H2,1H3
charge 0 multiplicity 1
34 atoms
Cl 2.137153 -2.488506 -2.515917
O  0.683377 -0.759791 -0.63213
O  -4.770836 1.769236 1.68613
O  -6.404898 0.788327 0.346127
O  6.789912 0.049326 1.098017
O  7.005856 -1.4281 -0.629945
N  6.296717 -0.68891 0.158091
C  -1.656609 -0.229022 -0.262894
C  -0.23533 0.027936 0.208194
C  -2.712234 0.443959 0.392903
C  -4.052511 0.232323 -0.01117
C  -1.944948 -1.116067 -1.32772
C  2.040481 -0.688877 -0.379423
C  -4.339587 -0.658011 -1.07805
C  -3.285137 -1.326361 -1.72968
C  2.884538 -1.477708 -1.215182
C  2.634808 0.104286 0.639125
C  4.831627 -0.686329 -0.025195
C  4.272031 -1.486055 -1.049549
C  4.028963 0.108084 0.819088
C  -5.195233 0.924293 0.652862
C  -5.850584 2.496623 2.392949
H  0.020341 1.103771 0.118033
H  -0.110836 -0.277754 1.267543
H  -2.516182 1.136469 1.218761
H  -1.122954 -1.631339 -1.831693
H  -5.383179 -0.806024 -1.373732
H  -3.5009 -2.014005 -2.554009
H  2.010784 0.719665 1.291724
H  4.923657 -2.089493 -1.686006
H  4.503031 0.712045 1.596577
H  -6.393488 3.150553 1.689972
H  -5.335025 3.085125 3.164671
H  -6.561004 1.783236 2.843226
