program: Gaussian 09
title: 000287264
version: EM64L-G09RevD.01
frameworkgroup: C1[X(C10H9ClN2O)]
method: RPBEPBE
basis: SDD
operation: Freq
keyword: #p
keyword: freq=noraman
keyword: PBEPBE/SDD
title: #p freq=noraman PBEPBE/SDD
converged: YES YES NO NO
title: Mulliken charges:
elementType: Cl O N N C C C C C C C C C C H H H H H H H H H
charge: -0.064383 -0.241534 -0.443594 0.004014 0.313588 0.323597 -0.375850 -0.635066 -0.340311 -0.246117 -0.231523 0.252723 -0.676556 -0.137728 0.272472 0.273034 0.232985 0.308019 0.341686 0.235174 0.234795 0.298916 0.301656
chargesum: 0.00000
title: Mulliken charges with hydrogens summed into heavy atoms:
elementType: Cl O N N C C C C C C C C C C
charge: -0.064383 -0.241534 -0.101907 0.004014 0.313588 0.323597 -0.142865 -0.089560 -0.032291 -0.010942 0.003272 0.252723 -0.075983 -0.137728
polarizability: 1.72587773e+02 4.73013054e+00 1.44294075e+02 5.96895819e+00 -8.10593314e+00 7.34335140e+01
1716.lowfreq: -5.5721 -2.3203 0.0010 0.0015 0.0025 8.0165 25.2137 45.3486 74.0208
frequency: 25.1915 45.3436 74.0202 82.7565 93.0793 102.4133 186.8900 203.8875 263.3599 296.8682 363.0005 374.3714 390.0407 423.6344 456.4808 487.8961 527.9213 572.7643 617.9534 642.0963 683.1541 702.7487 742.9483 771.9291 805.5304 846.4670 887.7855 906.3015 915.9702 925.6517 948.6194 963.5065 1002.1073 1048.7075 1102.9404 1150.3438 1177.1464 1183.4195 1194.2528 1213.6390 1257.3344 1272.5514 1293.9513 1313.6047 1383.7750 1418.9747 1445.2299 1453.0107 1482.1401 1535.3815 1599.5101 1615.6236 1617.4050 2195.9723 2979.7389 3053.1248 3070.0915 3127.5668 3144.0051 3153.8190 3166.8611 3193.3702 3460.9045
redmass: 9.6120 9.5082 4.4669 3.9329 5.5520 6.5218 4.7757 6.9055 5.8220 4.3787 4.1321 7.2655 3.9768 5.8570 3.9457 5.0965 3.5453 3.0968 5.4902 5.8341 6.4484 1.2809 3.1520 1.3787 4.1824 4.7151 1.4714 1.7317 2.3683 3.1765 5.1549 1.4249 1.3188 2.1883 2.2823 1.1144 1.1565 1.1823 1.7075 3.4115 1.1937 1.5411 1.8932 1.5183 6.7380 1.1010 2.5175 1.2353 1.9297 2.2494 6.6941 3.7041 7.4194 12.4058 1.0649 1.0941 1.0568 1.0883 1.0900 1.1090 1.0982 1.0955 1.0762
irintensity: 0.6330 4.1257 14.6395 1.8952 3.7651 1.7611 1.4197 6.8491 5.3190 3.7285 0.7812 1.5178 5.7408 1.8773 12.3878 16.7623 3.9633 2.2594 8.2979 0.9563 72.0257 54.9925 0.8590 99.8663 3.1130 0.9456 2.7925 9.1374 1.0916 3.6250 2.6143 3.6317 2.0303 10.9110 2.9427 1.5754 0.2159 2.0378 6.9374 12.5384 17.7420 2.4979 19.9639 24.9467 42.6692 30.5900 70.7292 33.0489 11.2136 396.7489 175.4367 41.9391 59.8670 5.8934 6.8666 2.0802 3.1902 6.4467 13.0937 0.4605 19.9924 7.7629 76.5116
temp: 298.150 k
press: 1.00000 atm
elementType: 17 8 7 7 6 6 6 6 6 6 6 6 6 6 1 1 1 1 1 1 1 1 1
symmnumber: 1
zpe: 446428.9 jmol-1
zpe.correction: 0.170036 hartree
zpe.thermalcorrener: 0.183239 hartree
zpe.thermalcorrenthalpy: 0.184183 hartree
zpe.thermalcorrgfe: 0.128081 hartree
zpe.sumelectzpe: -1030.251604 hartree
zpe.sumelectthermal: -1030.238401 hartree
zpe.sumelectthermalent: -1030.237457 hartree
zpe.sumelectthermalfe: -1030.293558 hartree
dipole: -2.0009 -0.1413 -2.7826
dipole: 3.4302
quadrupole: -77.2530 -98.8433 -92.5835
quadrupole: -6.5323 0.5954 -9.9112
quadrupole: 12.3069 -9.2833 -3.0236 -6.5323 0.5954 -9.9112
hfenergy: -1030.4216394 hartree
pointgroup: C01 [X(C10H9Cl1N2O1)]
dipole: -0.8356955 0.4265764 0.9700313 debye
dipolederiv: -0.2887869 -0.0082163 -0.008191 0.2175134 -0.5912321 0.1477379 -0.0869482 0.1593413 -0.1977582 -0.819296 0.1058857 -0.07842 -0.5594526 -0.8783006 0.0554848 0.080336 0.1033226 -0.354342 -1.7509421 -0.0038066 -0.1412345 -0.071347 -0.4454699 0.0468847 -0.0917525 0.0420501 -0.2924647 -0.216054 0.0228673 -0.0076953 -0.0110053 -0.2616044 0.0083658 -0.008453 -0.0982962 -0.1909934 -0.1758733 0.0511137 -0.003741 -0.0505576 0.1951639 -0.0311395 0.0361388 -0.0772272 -0.1323636 0.9404024 -0.1820965 0.1113411 -0.4436782 0.0899461 -0.049729 0.1331045 -0.0069072 0.1151157 0.0694203 -0.0081427 0.0000395 0.1084737 -0.0127213 -0.0528153 -0.0204146 -0.0450463 -0.1300099 0.1483097 0.0833474 0.061441 0.0793848 0.1506357 -0.0474643 0.0377907 -0.0179141 0.1325538 -0.1760532 0.025535 -0.0222051 0.213701 -0.1436482 0.0092577 -0.0508892 0.0074343 -0.1478149 -0.0196851 -0.0582928 0.0172881 -0.0668758 -0.1212152 -0.0212267 0.0259193 -0.008993 -0.1476784 0.0398955 0.0233247 0.0066751 -0.0482772 0.1509485 -0.0901183 0.0202669 -0.0823666 -0.1199531 1.7713429 -0.0760482 0.191323 0.913555 0.8575398 -0.0373335 -0.1112293 -0.1071181 0.1932114 -0.0654851 0.1978705 -0.0677186 -0.1032342 0.6903346 -0.1879568 0.0532261 -0.1829008 0.2060483 -0.0074108 -0.0855049 -0.0624813 -0.0387764 -0.057359 0.097303 -0.031678 0.1698485 0.0195463 -0.028302 -0.0650593 0.0666503 -0.0050694 0.0611272 -0.0228581 0.0047755 -0.0356266 0.0999566 0.0711372 0.0729783 -0.1020954 0.0344659 0.012238 -0.0091759 -0.0545355 -0.0022171 0.0127741 -0.0289141 -0.0852 0.0108894 -0.1200098 0.0120193 0.041727 0.029026 0.0330814 0.1357689 0.1173574 -0.0716195 0.0220286 -0.0418197 0.1077407 0.0150585 0.0168175 0.0103396 0.1757758 0.2965461 -0.0318871 0.0482124 -0.0945985 0.2388961 0.0055184 0.0628427 0.0038091 0.2733801 -0.0834256 0.0805896 -0.0271503 0.068452 0.0583849 0.0274299 -0.0252628 0.0343159 0.1582754 0.0796004 0.0133601 -0.0064141 0.0364276 -0.0903887 0.066974 -0.0141201 0.0662098 0.1359468 0.0669744 -0.0150164 -0.0504712 -0.0421881 -0.0198456 -0.0136616 -0.0789539 0.0193006 0.0397858 0.0592419 0.0140181 0.0419292 0.0249163 -0.00319 0.0417375 0.0739931 0.01556 0.0152391 unknown
polarizability: 165.0045791|-12.7129887|151.6046536|4.3036034|-11.0421955|73.7061293 unknown
InChI: InChI=1S/C10H9ClN2O/c11-7-10(14)13-9-4-2-1-3-8(9)5-6-12/h1-4,13H,5,7H2
charge 0 multiplicity 1
23 atoms
Cl 3.069128 -2.030138 1.106366
O  2.442755 1.862094 0.086358
N  0.97886 0.0222 0.352317
N  -0.417354 -3.291492 -1.105953
C  -1.461996 -0.206195 0.361012
C  -0.305837 0.609975 0.160398
C  -2.741053 0.358606 0.163368
C  -1.352413 -1.669706 0.802558
C  -0.456811 1.970603 -0.217868
C  -2.89566 1.709631 -0.216945
C  -1.746663 2.508965 -0.402743
C  2.214486 0.635827 0.314807
C  3.440973 -0.252702 0.552971
C  -0.830939 -2.570633 -0.249948
H  -2.35254 -2.0366 1.094766
H  -0.712741 -1.77811 1.702217
H  -3.627217 -0.269881 0.311519
H  0.433719 2.585733 -0.35791
H  1.018771 -0.988261 0.528949
H  -3.896293 2.128369 -0.363697
H  -1.848738 3.559253 -0.6961
H  4.060716 0.191612 1.344426
H  4.020147 -0.345249 -0.377966
