program: Gaussian 09
title: 000287258
version: EM64L-G09RevD.01
frameworkgroup: C1[X(C5H7ClN4)]
method: RPBEPBE
basis: SDD
operation: Freq
keyword: #p
keyword: freq=noraman
keyword: PBEPBE/SDD
title: #p freq=noraman PBEPBE/SDD
converged: YES YES NO NO
title: Mulliken charges:
elementType: Cl N N N N C C C C C H H H H H H H
charge: -0.084771 -0.089184 -0.680705 -0.645586 -0.648982 0.271106 0.061282 -0.104544 0.183872 -0.368156 0.242509 0.297378 0.301775 0.319927 0.316798 0.319155 0.308128
chargesum: 0.00000
title: Mulliken charges with hydrogens summed into heavy atoms:
elementType: Cl N N N N C C C C C
charge: -0.084771 -0.089184 -0.081553 -0.008861 -0.021699 0.271106 0.061282 -0.104544 0.183872 -0.125648
polarizability: 1.23148267e+02 6.70978271e+00 1.24272424e+02 -6.00559968e-01 8.00760324e-01 3.97064549e+01
1716.lowfreq: -7.7721 -2.5944 -0.0030 0.0005 0.0013 6.9874 110.7327 159.0396 190.4084
frequency: 110.7322 159.0387 190.4073 216.4138 230.1177 289.7536 298.0049 300.7745 338.5654 381.2124 430.5234 480.7452 515.7549 528.7853 537.8168 560.2472 595.8098 629.5720 652.6770 734.6417 774.5317 782.6222 821.3674 958.7903 1002.3752 1077.6822 1128.9150 1207.8509 1259.8189 1360.7100 1385.7682 1448.0852 1488.5486 1553.4041 1592.3919 1615.8966 1623.0023 1639.6035 3177.6142 3468.3341 3518.9082 3566.7696 3600.9933 3673.5819 3721.6119
redmass: 4.1715 3.8210 1.2872 5.9435 5.1418 3.1899 3.2890 1.1962 5.0269 7.0772 1.0673 6.2352 1.9433 2.0609 1.1715 3.2976 4.0979 1.4086 2.9152 4.5818 4.6554 1.9296 6.2751 2.6579 1.6929 1.4734 2.2031 1.4595 3.3054 6.6038 4.6611 4.4507 5.8212 3.1391 1.4577 1.5058 2.8462 1.2833 1.0932 1.0459 1.0444 1.0445 1.0983 1.1031 1.1049
irintensity: 1.4678 5.6493 17.2936 1.1066 9.6323 5.6398 11.6655 228.9367 21.5973 1.7595 63.7400 3.6762 55.1200 105.3147 64.5330 153.3211 39.2286 290.8534 28.8517 9.0879 16.5071 48.9389 63.7135 4.9089 5.3153 21.2727 20.3432 29.7705 20.5308 6.9211 24.5240 4.1470 465.6019 121.0685 119.4838 185.2058 396.1661 40.0555 3.1343 8.2586 46.4456 84.5315 22.5853 36.5791 30.8799
temp: 298.150 k
press: 1.00000 atm
elementType: 17 7 7 7 7 6 6 6 6 6 1 1 1 1 1 1 1
symmnumber: 1
zpe: 332745.9 jmol-1
zpe.correction: 0.126736 hartree
zpe.thermalcorrener: 0.136815 hartree
zpe.thermalcorrenthalpy: 0.137759 hartree
zpe.thermalcorrgfe: 0.091966 hartree
zpe.sumelectzpe: -873.076276 hartree
zpe.sumelectthermal: -873.066198 hartree
zpe.sumelectthermalent: -873.065253 hartree
zpe.sumelectthermalfe: -873.111047 hartree
dipole: -0.9199 0.8664 0.2772
dipole: 1.2937
quadrupole: -59.1156 -48.9264 -69.8228
quadrupole: 7.6786 1.7935 0.5120
quadrupole: 0.1727 10.3619 -10.5345 7.6786 1.7935 0.5120
hfenergy: -873.2030127 hartree
pointgroup: C01 [X(C5H7Cl1N4)]
dipole: -0.1241782 -0.4773728 -0.1255389 debye
dipolederiv: -0.4138396 -0.3228426 -0.0161358 -0.3080147 -0.5407538 -0.020501 -0.0300427 -0.0158537 -0.0858297 -0.7745289 0.2013746 -0.0171299 0.3146041 -0.592208 0.011068 -0.0261639 0.0232786 -0.2900022 -1.0832421 0.2419882 -0.0648128 0.3403235 -0.3885507 0.2550546 -0.2098296 0.2317891 -0.4132822 -0.3400818 0.373462 0.1319494 0.3602016 -1.3971905 -0.0434212 0.1578321 -0.2539492 -0.6560483 -1.6761971 0.1575927 -0.0287587 0.0949096 -0.1536199 0.0196601 -0.0265497 0.0149214 -0.7729211 0.719614 -0.6524515 0.0109418 -0.0043079 -0.8034465 -0.1060824 -0.0739447 -0.0675969 -0.0096411 0.4377992 0.0139835 -0.0094089 -0.557722 1.6394202 0.0152511 -0.0827689 0.0131393 0.1353184 0.8582758 0.0764459 0.0034222 0.3450004 1.0704485 0.0604303 0.1451578 0.0506285 -0.0412334 1.9094772 -0.3117952 0.0647878 0.1181771 0.3589144 0.0072096 0.0918484 0.034337 0.1824796 -0.8429442 0.2768362 -0.0046776 -0.5117347 -0.3356736 -0.0061887 -0.0290949 -0.01096 -0.2229995 0.0578163 0.0530342 -0.0004524 0.0628226 -0.031228 -0.012056 -0.0146901 -0.0298948 0.202482 0.159567 -0.0137558 -0.0004541 -0.1095704 0.2510284 -0.1148356 0.174992 -0.1497834 0.1863284 0.194808 -0.0181176 0.0281194 -0.0734731 0.1553449 -0.074035 0.0518726 -0.0367984 0.3124041 0.1881914 -0.0409489 -0.0633224 -0.0380117 0.2517275 -0.0036412 -0.1001373 0.1171567 0.3253088 0.1502069 -0.020299 -0.0175518 -0.0196405 0.2405192 0.0265914 -0.0124551 0.0947961 0.3604806 0.2280905 0.0073648 -0.0077221 0.0350592 0.1520861 -0.0059917 -0.0006428 -0.007274 0.3912087 0.2269873 -0.0218713 -0.0087942 -0.0486233 0.123182 -0.0085122 -0.0153833 -0.0079361 0.3959469 unknown
polarizability: 129.4176631|-3.5561147|117.8279945|2.3296898|3.0603932|39.8814883 unknown
InChI: InChI=1S/C5H7ClN4/c6-2-1-3(7)10-5(9)4(2)8/h1H,7-9H2
charge 0 multiplicity 1
17 atoms
Cl 1.764132 2.501219 0.099646
N  -1.191895 -1.053347 -0.102561
N  2.50935 -0.541937 -0.006775
N  0.597856 -2.584385 -0.053087
N  -3.036428 0.382261 -0.133728
C  1.128434 -0.212964 -0.029586
C  0.149312 -1.266693 -0.052585
C  0.596244 1.090213 0.018509
C  -1.65492 0.235244 -0.080682
C  -0.785325 1.358607 0.012869
H  -1.164623 2.380951 0.068728
H  2.837778 -1.156234 -0.757299
H  3.14289 0.231049 0.207326
H  1.529232 -2.775339 0.315378
H  -0.112352 -3.313365 -0.018409
H  -3.605111 -0.45867 -0.181814
H  -3.474874 1.297091 -0.13303
