program: Gaussian 09
title: 000287253
version: EM64L-G09RevD.01
frameworkgroup: C1[X(C5H7F3N2O)]
method: RPBEPBE
basis: SDD
operation: Freq
keyword: #p
keyword: freq=noraman
keyword: PBEPBE/SDD
title: #p freq=noraman PBEPBE/SDD
converged: YES YES NO NO
title: Mulliken charges:
elementType: F F F O N N C C C C C H H H H H H H
charge: -0.156065 -0.169554 -0.147008 -0.237949 -0.301821 -0.344641 0.193933 -0.584411 0.355260 -0.706000 0.188072 0.280025 0.268999 0.300099 0.240967 0.235548 0.246181 0.338365
chargesum: 0.00000
title: Mulliken charges with hydrogens summed into heavy atoms:
elementType: F F F O N N C C C C C
charge: -0.156065 -0.169554 -0.147008 -0.237949 -0.001722 -0.006276 0.193933 -0.035387 0.355260 0.016696 0.188072
polarizability: 8.17178436e+01 9.92160217e+00 5.83686470e+01 2.63633855e+00 2.16971984e+00 6.92965531e+01
1716.lowfreq: -14.3130 -7.9090 0.0008 0.0010 0.0014 14.8629 49.0508 61.4389 160.3058
frequency: 49.0042 61.2511 160.3048 203.6645 219.6554 231.1585 302.7159 307.0195 317.9885 354.0336 440.8960 452.8702 462.5371 527.0569 539.9482 558.9633 606.9126 684.8867 693.8461 777.3102 869.4266 898.8752 947.4410 995.1241 1014.5554 1029.2163 1057.1050 1071.6790 1128.4751 1139.4032 1203.2004 1242.5984 1277.7597 1285.0877 1350.5577 1395.5308 1431.9930 1458.9068 1466.5221 1480.4778 1670.6641 3005.7595 3040.3231 3105.2343 3107.0151 3120.8089 3362.0254 3566.4476
redmass: 6.8669 8.7797 6.0183 4.5068 1.2159 4.2897 2.9016 3.5516 4.6975 7.7083 2.5492 2.4593 5.9073 4.9088 5.4312 2.5541 6.0756 5.2000 5.5700 2.9518 3.5878 2.3281 1.7906 1.5420 6.7162 4.5154 5.3002 2.7448 1.6593 2.9709 2.8370 2.0682 1.5699 3.2054 1.5419 1.1997 1.3849 1.0881 1.0679 1.0641 9.1355 1.0356 1.0629 1.1009 1.1014 1.1006 1.0765 1.0797
irintensity: 4.2230 1.4995 1.9131 1.5707 0.4253 0.8378 3.8038 6.9273 3.7907 8.4041 35.0070 51.5565 3.6011 14.7499 9.9758 86.3853 13.5988 33.9862 34.2800 22.4715 6.1290 32.3162 13.0775 24.2148 208.2503 159.8009 17.5254 124.8562 46.5164 31.1098 10.7578 29.3807 12.1645 67.6073 15.7247 19.3791 14.6877 13.9192 8.6040 15.2304 380.8261 9.8986 3.3475 6.9279 5.4684 11.5281 2.7567 45.2941
temp: 298.150 k
press: 1.00000 atm
elementType: 9 9 9 8 7 7 6 6 6 6 6 1 1 1 1 1 1 1
symmnumber: 1
zpe: 333005.9 jmol-1
zpe.correction: 0.126835 hartree
zpe.thermalcorrener: 0.137434 hartree
zpe.thermalcorrenthalpy: 0.138379 hartree
zpe.thermalcorrgfe: 0.090479 hartree
zpe.sumelectzpe: -678.111587 hartree
zpe.sumelectthermal: -678.100988 hartree
zpe.sumelectthermalent: -678.100044 hartree
zpe.sumelectthermalfe: -678.147943 hartree
dipole: 1.6492 2.9836 1.2454
dipole: 3.6295
quadrupole: -78.2973 -65.2269 -56.7909
quadrupole: -2.1736 -5.7663 -2.1787
quadrupole: -11.5256 1.5448 9.9808 -2.1736 -5.7663 -2.1787
hfenergy: -678.2384223 hartree
pointgroup: C01 [X(C5H7F3N2O1)]
dipole: 0.4410711 -1.2138054 0.609213 debye
dipolederiv: -0.5988786 -0.2471611 -0.1740565 -0.2713091 -0.5226614 -0.2085298 -0.0951779 -0.1295453 -0.4466248 -0.6459319 0.2574244 0.1076965 0.1792644 -0.5530021 -0.0407729 0.1532882 -0.1051795 -0.3396622 -0.3839136 0.0039715 -0.0048402 0.0381485 -0.3924792 0.2397257 -0.0820197 0.250791 -0.6974763 -1.0379901 0.5002638 -0.1319544 0.3611569 -0.7266186 -0.0148277 -0.1834769 0.0632489 -0.4374147 -0.1670059 -0.0628539 -0.065798 -0.1064134 -0.4956307 -0.108675 -0.1219623 0.0910415 -0.1194137 -0.2035308 0.0032337 0.1038603 0.2879098 -0.5639698 -0.0951686 0.3300278 -0.4353361 -0.5602452 0.1195379 0.0516141 0.0821056 0.0724531 0.123687 -0.0108202 0.1704412 0.0170476 0.2835601 -0.1950774 0.0375337 -0.225698 -0.0319658 -0.0010329 -0.0607033 -0.2731751 -0.0246937 -0.1383372 1.5621806 -0.0275177 0.0266141 0.057892 1.3185447 -0.0171895 -0.0333453 -0.0181838 1.3204289 -0.03322 -0.0253923 0.016045 0.0030755 0.0354658 0.0674015 -0.0339279 0.0451461 -0.0463179 1.1324361 -0.5749117 0.2703662 -0.6532927 1.1025641 0.2786585 0.1746767 0.2979112 0.5420338 0.0739541 -0.0521853 -0.0209879 -0.0325679 -0.0076482 0.0099071 0.0064974 0.0224925 0.1153621 0.0324252 0.0046762 0.0471624 -0.0021951 0.104175 0.0370655 0.0514937 -0.0013725 -0.0252602 0.0920002 0.1044487 0.0465377 0.0212532 0.3371967 0.0155724 0.0206191 -0.0591285 0.0686101 0.022362 0.1048013 -0.0014572 0.1187422 -0.0009371 0.00132 0.0313494 -0.0541579 0.0723479 0.0677774 -0.0417252 -0.0648966 -0.0640762 -0.0064308 -0.0925595 -0.0719882 -0.041957 0.0264208 -0.0335359 -0.0574542 0.0795469 -0.0394908 0.0830559 0.0429064 0.0573025 0.039959 0.0440699 0.1964109 0.021234 -0.090246 0.0614154 0.1657217 -0.0433107 -0.1006227 0.0419164 0.3379184 unknown
polarizability: 77.665007|-10.5716435|68.5635329|8.43236|3.1526263|63.1545038 unknown
InChI: InChI=1S/C5H7F3N2O/c1-4(5(6,7)8)2-3(11)9-10-4/h9-10H,2H2,1H3
charge 0 multiplicity 1
18 atoms
F  2.089914 1.182414 0.459633
F  2.261124 -0.789657 -0.662182
F  0.994979 0.889844 -1.504066
O  -3.024838 1.233482 -0.649755
N  -0.567472 -1.366858 -0.373623
N  -1.665936 -0.656191 -1.020046
C  0.135193 -0.32144 0.475974
C  -0.923618 0.800648 0.661061
C  1.353128 0.245278 -0.298446
C  0.622234 -0.964137 1.787657
C  -2.001644 0.541198 -0.407772
H  -0.513254 1.817771 0.562537
H  -1.400055 0.728172 1.653713
H  0.065488 -1.745589 -1.101239
H  1.337399 -1.781034 1.591041
H  1.10636 -0.218563 2.441239
H  -0.249501 -1.390583 2.308537
H  -2.346604 -1.220856 -1.531363
