program: Gaussian 09
title: 000287255
version: EM64L-G09RevD.01
frameworkgroup: C1[X(C11H10N4O5)]
method: RPBEPBE
basis: SDD
operation: Freq
keyword: #p
keyword: freq=noraman
keyword: PBEPBE/SDD
title: #p freq=noraman PBEPBE/SDD
converged: YES YES NO NO
title: Mulliken charges:
elementType: O O O O O N N N N C C C C C C C C C C C H H H H H H H H H H
charge: -0.264861 -0.466968 -0.195230 -0.214474 -0.250822 0.015755 0.067865 -0.417444 -0.649775 -0.213815 0.346678 -0.304142 0.176401 0.127736 -0.309705 0.037557 -0.349501 -0.224686 -0.212501 0.288493 0.283199 0.288084 0.295686 0.285895 0.245000 0.245695 0.387059 0.339157 0.342506 0.301156
chargesum: 0.00000
title: Mulliken charges with hydrogens summed into heavy atoms:
elementType: O O O O O N N N N C C C C C C C C C C C
charge: -0.264861 -0.079909 -0.195230 -0.214474 -0.250822 0.015755 0.067865 -0.078286 -0.006113 0.069384 0.346678 -0.016058 0.176401 0.127736 -0.014018 0.037557 -0.063606 0.020314 0.033194 0.288493
polarizability: 3.04117716e+02 1.13044345e+01 1.68127645e+02 4.12156689e-01 -6.13916601e-01 9.25232744e+01
1716.lowfreq: -8.6942 -3.6992 -0.0007 -0.0007 -0.0004 6.1907 21.7446 30.2123 31.7617
frequency: 21.6042 30.1322 31.7156 63.3126 73.5223 105.1772 107.8672 141.6931 166.6723 201.9179 231.8557 242.0189 274.8158 276.3118 302.5937 349.8994 356.3729 363.9125 392.1523 404.5417 413.6949 432.6586 481.9113 493.7903 521.4475 560.5962 598.5410 608.0253 625.3831 643.1879 660.0914 669.3897 675.5478 707.5315 717.4214 745.9037 766.2846 787.7598 790.2632 808.2510 827.9204 899.1647 904.0754 931.8385 983.6561 1008.2978 1019.4852 1037.2881 1044.2787 1060.7939 1066.2373 1136.3444 1152.4068 1153.9107 1172.0982 1184.5681 1207.4298 1213.7812 1232.9670 1263.3538 1298.9337 1302.3308 1363.8884 1390.3293 1394.4321 1432.4784 1466.9186 1508.2367 1577.8401 1604.1717 1607.4113 1632.8801 1634.2235 1682.3392 3021.8140 3146.9129 3164.9812 3182.4847 3188.1923 3223.4633 3421.5410 3539.4685 3592.5601 3698.2336
redmass: 8.8949 8.1324 4.4468 6.2083 7.8554 6.6313 5.3527 6.4612 8.7245 5.3146 6.6147 5.7815 5.9953 2.2428 5.5440 1.9352 2.3495 4.0636 5.6738 2.4769 3.7755 4.1411 1.1300 4.1244 5.2340 4.6317 4.9879 5.9460 1.3340 6.8606 7.2659 5.3767 5.2678 7.7548 4.0423 2.2284 4.5089 4.1026 1.7677 3.8201 3.6183 3.4665 1.4898 3.5302 1.3687 1.3583 2.5485 2.4159 2.8209 3.4020 2.7172 2.0865 2.7027 2.1950 1.3199 1.6035 3.4930 2.0866 2.1492 1.7589 1.4827 2.3382 6.6436 6.6898 2.8182 2.3761 2.5331 1.6404 6.5158 1.2310 5.9753 11.1447 7.7612 5.5391 1.0839 1.0874 1.0923 1.0937 1.0983 1.0980 1.0775 1.0458 1.0664 1.1035
irintensity: 3.2516 3.3366 16.4016 0.7781 6.9575 3.8555 2.3789 1.9605 4.5695 0.8315 4.1966 1.6301 7.1180 22.8851 0.6386 24.4541 41.6597 28.1206 4.0019 78.4120 17.2684 9.8740 212.4503 11.2788 11.2675 12.1095 15.2138 1.8075 173.2687 6.4886 19.1220 11.5777 4.2103 16.7561 25.9868 26.0520 10.9752 32.3858 48.9747 24.5298 12.1506 5.9662 1.2003 51.9014 4.2586 1.2228 41.9498 146.6383 29.7425 4.9158 146.6025 0.9284 171.9807 156.7889 25.9623 8.1154 195.5807 44.3619 92.5754 11.9306 50.2950 491.6645 168.5149 13.1317 0.1722 8.9633 51.7200 588.8067 14.7756 114.3955 6.8073 5.3548 92.7300 340.9288 21.8347 3.6808 9.5617 0.6013 9.7025 13.5204 29.9436 57.8698 45.0857 46.4848
temp: 298.150 k
press: 1.00000 atm
elementType: 8 8 8 8 8 7 7 7 7 6 6 6 6 6 6 6 6 6 6 6 1 1 1 1 1 1 1 1 1 1
symmnumber: 1
zpe: 552804.7 jmol-1
zpe.correction: 0.210552 hartree
zpe.thermalcorrener: 0.228661 hartree
zpe.thermalcorrenthalpy: 0.229605 hartree
zpe.thermalcorrgfe: 0.162382 hartree
zpe.sumelectzpe: -1018.720551 hartree
zpe.sumelectthermal: -1018.702442 hartree
zpe.sumelectthermalent: -1018.701498 hartree
zpe.sumelectthermalfe: -1018.768721 hartree
dipole: -0.4170 -2.4541 6.7554
dipole: 7.1995
quadrupole: -114.7181 -108.8027 -114.8805
quadrupole: -37.9113 13.0634 -1.3675
quadrupole: -1.9177 3.9978 -2.0801 -37.9113 13.0634 -1.3675
hfenergy: -1018.9311027 hartree
pointgroup: C01 [X(C11H10N4O5)]
dipole: 0.2082471 0.5756061 2.7655604 debye
polarizability: 303.4368356|14.8177954|167.005462|-3.447932|11.1043792|94.326338 unknown
InChI: InChI=1S/C11H10N4O5/c12-11(17)14-13-10-8(16)5-9(20-10)6-3-1-2-4-7(6)15(18)19/h1-5,9,14,16H,12H2
charge 0 multiplicity 1
30 atoms
O  -0.490165 -0.034975 -1.036156
O  -2.102316 1.656553 1.756624
O  4.964301 1.510835 -0.29508
O  2.844785 2.316257 -0.115841
O  -5.262987 -1.498246 -0.908696
N  3.694635 1.336605 -0.155251
N  -2.760423 -0.27435 -0.525994
N  -3.870017 0.040499 0.237259
N  -6.145158 -0.091805 0.733835
C  0.704285 0.685102 -0.493194
C  1.793561 -0.348186 -0.165615
C  0.175174 1.45648 0.709958
C  3.179755 -0.047419 -0.024604
C  -1.156435 1.200826 0.831063
C  1.4210 -1.708449 -0.027899
C  -1.617669 0.273085 -0.220756
C  4.147012 -1.045154 0.247606
C  2.371273 -2.710373 0.260477
C  3.740408 -2.381563 0.399327
C  -5.102901 -0.589655 -0.056422
H  1.050989 1.372039 -1.286011
H  0.812252 2.106977 1.306897
H  0.371888 -1.970982 -0.18351
H  5.195757 -0.748745 0.331205
H  2.042136 -3.749512 0.364884
H  4.480685 -3.157575 0.616811
H  -1.698005 2.263865 2.423388
H  -3.781433 0.691797 1.028355
H  -7.058633 -0.516023 0.596419
H  -6.064253 0.721992 1.33992
