program: Gaussian 09
title: 000287250
version: EM64L-G09RevD.01
frameworkgroup: C1[X(C10H10F3NO)]
method: RPBEPBE
basis: SDD
operation: Freq
keyword: #p
keyword: freq=noraman
keyword: PBEPBE/SDD
title: #p freq=noraman PBEPBE/SDD
converged: NO YES NO NO
title: Mulliken charges:
elementType: F F F O N C C C C C C C C C C H H H H H H H H H H
charge: -0.136993 -0.153318 -0.174009 -0.246987 -0.347217 -0.469567 0.440228 0.363322 0.225702 -0.401949 -0.400075 -0.222480 -0.231871 -0.237690 -0.608741 0.298356 0.244014 0.273145 0.340887 0.233896 0.233594 0.236174 0.230089 0.275777 0.235712
chargesum: 0.00000
title: Mulliken charges with hydrogens summed into heavy atoms:
elementType: F F F O N C C C C C C C C C C
charge: -0.136993 -0.153318 -0.174009 -0.246987 -0.006330 -0.171211 0.440228 0.363322 0.225702 -0.157934 -0.126930 0.011416 0.001724 -0.001516 0.132837
polarizability: 1.40590229e+02 6.59684236e-01 8.95669667e+01 -8.11715877e+00 -4.75131264e+00 1.11516281e+02
1716.lowfreq: -13.6187 -1.8843 -0.0013 -0.0005 0.0002 7.2380 14.1206 39.2070 64.1303
frequency: 5.8660 39.1016 64.0905 73.9463 94.4379 105.3583 140.0208 198.1220 217.3986 266.4546 270.1206 290.4889 305.9403 360.5121 402.3874 456.7691 472.2829 497.9155 556.8386 602.7118 615.8165 639.7247 668.2869 705.0128 714.6253 768.8235 796.3139 844.7033 859.1385 878.7710 929.9025 982.4841 988.4738 993.4522 1000.9999 1031.9170 1034.3422 1070.3242 1092.3219 1120.6826 1141.8174 1169.2997 1176.9406 1200.0215 1203.8835 1217.7934 1261.3979 1322.7811 1354.5654 1384.0300 1420.5943 1444.4691 1458.3575 1485.3937 1486.9635 1519.4829 1591.9796 1613.2074 1642.9159 2985.4815 3054.9680 3067.4171 3116.5058 3125.0200 3132.9645 3145.6117 3156.3661 3169.5711 3534.0474
redmass: 6.2091 3.9126 8.5411 4.9272 1.4349 2.2658 6.9639 4.4835 4.0950 7.1974 6.3320 8.1914 6.7054 7.3554 2.8342 10.2611 15.6920 3.9993 7.1685 1.2121 6.5146 7.4146 5.3153 2.6473 2.4502 2.2365 5.4227 3.4715 1.2481 3.9392 1.4243 1.4657 6.8880 5.3862 1.3315 2.3558 6.9812 6.0147 1.6644 1.3021 1.6373 4.7160 1.0666 1.8151 1.1261 2.8509 1.7073 1.5156 1.3911 5.1598 1.1695 2.1478 1.2251 1.0576 2.1353 1.4765 5.9097 5.9322 7.7678 1.0347 1.0835 1.1026 1.0989 1.0873 1.0870 1.0922 1.0954 1.1014 1.0778
irintensity: 8.4861 0.8059 0.5682 0.3971 0.3485 0.7963 1.6156 2.8613 1.9554 0.3261 1.8032 2.5974 6.2683 14.6791 0.3878 3.1018 0.7532 7.7119 53.5397 74.3530 1.2820 9.7766 9.0544 13.0330 72.1395 24.5028 20.5331 17.2523 0.3220 7.8667 0.9855 7.6345 55.7766 86.4338 1.0109 26.7573 145.1217 49.1546 16.1900 2.7148 43.9077 175.2915 3.9922 72.8290 1.5812 62.2738 2.9793 20.8394 17.1170 3.0299 25.3695 9.0911 71.8244 22.2548 18.4668 99.9104 3.9484 17.7665 238.6869 55.3146 1.1430 28.5123 2.1410 3.9440 0.9272 15.4356 15.8716 17.2572 35.7833
temp: 298.150 k
press: 1.00000 atm
elementType: 9 9 9 8 7 6 6 6 6 6 6 6 6 6 6 1 1 1 1 1 1 1 1 1 1
symmnumber: 1
zpe: 482936.8 jmol-1
zpe.correction: 0.183941 hartree
zpe.thermalcorrener: 0.198402 hartree
zpe.thermalcorrenthalpy: 0.199346 hartree
zpe.thermalcorrgfe: 0.139440 hartree
zpe.sumelectzpe: -815.474567 hartree
zpe.sumelectthermal: -815.460106 hartree
zpe.sumelectthermalent: -815.459162 hartree
zpe.sumelectthermalfe: -815.519068 hartree
dipole: -4.2726 2.6180 2.0855
dipole: 5.4276
quadrupole: -87.3299 -88.1074 -82.0282
quadrupole: -0.0664 5.2207 4.5740
quadrupole: -1.5081 -2.2856 3.7936 -0.0664 5.2207 4.5740
hfenergy: -815.6585074 hartree
pointgroup: C01 [X(C10H10F3N1O1)]
dipole: 1.4784178 1.5350088 -0.1336243 debye
dipolederiv: -0.760126 -0.2532517 0.0482027 -0.3090953 -0.4511256 0.0004273 -0.0223114 -0.0522488 -0.3100894 -0.5299293 0.1952165 0.0377828 0.2408773 -0.6985738 -0.1753611 0.1082318 -0.2609933 -0.3683958 -0.3625687 0.0057135 -0.1236888 -0.0261641 -0.5128347 0.1069251 -0.0833007 0.184986 -0.6302732 -0.7669574 -0.1578283 0.3445056 0.1029877 -0.5954216 0.0503592 0.3814766 0.2440861 -0.6553213 -0.5327269 0.0872125 0.0019369 0.1194058 -0.9754335 0.1918085 0.0014264 0.1564485 -0.4844907 -0.2514739 0.0915108 0.0883366 0.2201136 -0.1915862 -0.1229291 0.0913368 -0.1791101 -0.1516824 0.3661024 0.0471433 -0.0027497 0.1204404 -0.0781149 -0.0478194 -0.0229076 -0.0490343 -0.0245641 1.5027173 0.1235775 0.079273 0.0899523 1.6420024 0.1347553 0.0518215 0.2310992 1.3335062 0.8021351 0.0006433 -0.5686837 -0.3214152 1.2101134 -0.2592209 -0.5898452 -0.4603976 0.7177207 -0.1702078 0.029877 -0.063833 -0.0057866 -0.1304327 -0.042471 -0.0493861 -0.0381492 0.048064 -0.206625 0.0469118 0.0601134 0.0678067 -0.1325742 0.0360638 0.0614045 0.0058188 -0.0207529 0.0057474 0.0317219 0.0949414 0.0403078 -0.1155749 0.000659 0.0927819 -0.0071823 0.0824582 -0.0015564 0.0378285 -0.0693348 0.0553921 -0.1131285 -0.0512102 -0.0702937 -0.0630298 0.1035325 0.0545708 0.101584 -0.0017677 0.0776337 -0.1140386 -0.0174892 -0.0079581 -0.0092495 -0.0789343 0.2615795 -0.2264837 0.1104873 -0.1352882 0.3577773 0.0194732 0.0598633 0.1513428 0.1408772 0.059776 -0.0060899 -0.0162117 -0.0245804 0.0507378 0.0072353 0.0036968 0.0612983 0.0327706 0.0637843 -0.0533238 0.0810558 -0.0444198 0.11785 0.0559723 0.0614842 0.0463635 -0.0246594 0.094321 -0.008976 -0.064441 -0.0244793 0.138899 -0.005382 -0.078042 -0.0010906 0.0108863 0.2844514 0.0291858 0.0989421 -0.0380458 0.1802953 0.016521 0.0966592 0.0194079 0.2155363 0.0250909 -0.0314943 -0.0887209 -0.0356093 0.1433008 -0.0008827 -0.1035115 -0.0020709 -0.0472054 0.0536051 -0.0412868 0.0572502 -0.0517209 0.1297405 0.0534285 0.0759067 0.0560683 -0.0632234 -0.0861404 -0.0904869 0.0039277 -0.0955593 0.1231155 0.0133368 0.0040634 0.0118712 0.0933665 0.0030589 -0.0826783 -0.0686148 -0.0137882 -0.1264251 -0.0543213 -0.0357404 -0.0880632 0.0901628 0.054428 0.0229462 0.0476531 -0.0814493 0.134687 0.0658097 0.1023824 -0.0231006 0.0577234 0.0369437 0.100827 -0.0863626 0.0724845 0.0067455 0.024312 -0.1292386 0.0649297 -0.0670123 unknown
polarizability: 139.0853562|10.9733835|92.8542356|-4.7586547|-7.3226038|109.7338855 unknown
InChI: InChI=1S/C10H10F3NO/c1-14-9(15)8(10(11,12)13)7-5-3-2-4-6-7/h2-6,8,14H,1H3
charge 0 multiplicity 1
25 atoms
F  -2.414504 -2.014394 -0.495432
F  -0.298489 -2.424742 -1.18193
F  -1.396023 -0.578127 -1.917673
O  -2.555719 0.256368 1.728352
N  -1.509278 1.701099 0.222121
C  -0.64525 -0.622065 0.439283
C  0.789003 -0.111707 0.284046
C  -1.18059 -1.395874 -0.767863
C  -1.669083 0.49278 0.858992
C  1.573924 -0.000102 1.460919
C  1.349457 0.296906 -0.954636
C  2.885664 0.516689 1.407448
C  2.665345 0.810707 -1.006491
C  3.436671 0.927103 0.171319
C  -2.389882 2.84652 0.481239
H  -0.68429 -1.342042 1.275883
H  1.154051 -0.318321 2.422936
H  0.778864 0.19579 -1.883651
H  -0.728528 1.810457 -0.428784
H  3.477683 0.592722 2.325943
H  3.088651 1.112569 -1.970835
H  4.456709 1.323677 0.126383
H  -1.814763 3.709934 0.862427
H  -3.124622 2.540048 1.242204
H  -2.927899 3.147702 -0.435902
