program: Gaussian 09
title: 000287248
version: EM64L-G09RevD.01
frameworkgroup: C1[X(C13H14F3NO)]
method: RPBEPBE
basis: SDD
operation: Freq
keyword: #p
keyword: freq=noraman
keyword: PBEPBE/SDD
title: #p freq=noraman PBEPBE/SDD
converged: NO YES NO NO
title: Mulliken charges:
elementType: F F F O N C C C C C C C C C C C C C H H H H H H H H H H H H H H
charge: -0.158344 -0.135504 -0.165354 -0.262749 -0.136156 -0.346709 -0.387703 -0.453201 -0.451835 0.208747 -0.498270 0.472122 0.381308 -0.421128 -0.354337 -0.228916 -0.225127 -0.237610 0.261682 0.236325 0.257542 0.229843 0.226390 0.235266 0.229543 0.233471 0.278097 0.234132 0.285217 0.229929 0.231168 0.232161
chargesum: 0.00000
title: Mulliken charges with hydrogens summed into heavy atoms:
elementType: F F F O N C C C C C C C C C C C C C
charge: -0.158344 -0.135504 -0.165354 -0.262749 -0.136156 0.151297 0.099682 0.008455 0.011179 0.208747 -0.220173 0.472122 0.381308 -0.186996 -0.069119 0.001013 0.006042 -0.005449
polarizability: 1.56173892e+02 -2.15675138e+01 1.34756037e+02 5.70766103e+00 8.86521322e+00 1.38750999e+02
1716.lowfreq: -13.0859 -7.2088 -4.4627 -0.0006 -0.0005 -0.0003 15.8293 41.3471 56.1715
frequency: 13.9565 41.1425 56.0395 59.7007 75.2399 85.5614 109.1116 148.8028 185.0156 226.1537 239.0795 251.0447 274.3866 277.9706 295.1345 316.9412 404.4830 455.3336 468.6901 485.5147 503.4236 560.0088 568.9652 614.4343 626.7171 687.0067 702.4378 710.7984 753.5069 805.9549 829.1016 853.2942 857.9052 858.7455 865.5736 914.1696 919.1840 929.5831 961.9523 982.0448 989.8952 995.0081 1000.1844 1003.3837 1028.3325 1031.1448 1062.6706 1084.9831 1113.7254 1150.8965 1162.2602 1173.9985 1175.3240 1184.3816 1193.6473 1201.7781 1220.9079 1241.2598 1246.6765 1303.2066 1314.2399 1320.4449 1328.0501 1336.9480 1341.0111 1385.2869 1389.0994 1443.5916 1469.0645 1472.6122 1482.1175 1485.7453 1494.1191 1592.2008 1599.9261 1611.6684 2963.2486 2994.2263 3011.7447 3012.9010 3038.5551 3046.9810 3071.4824 3083.3560 3095.8139 3118.0383 3130.8449 3143.1953 3154.5613 3167.2868
redmass: 4.7414 4.0324 3.5752 8.8013 3.3594 5.1722 5.8099 6.8607 5.9955 4.0624 1.8954 3.1230 5.7063 7.2327 11.8751 8.2404 2.8394 13.2634 15.2967 3.9655 5.4505 6.9699 1.9402 6.4556 7.2751 7.5079 2.5053 2.3410 2.0078 2.8351 4.4997 2.6969 1.9016 1.6912 1.9261 2.4849 1.4677 1.4414 2.1526 1.4480 4.5273 2.7863 2.3719 2.0950 2.5752 4.2865 1.8712 1.6236 1.5739 2.5052 1.4565 1.1554 1.5926 2.0943 1.1518 4.9123 1.3310 1.6533 1.4538 1.3429 1.2258 1.5039 1.4344 1.5198 1.3189 7.6833 5.0361 2.1649 1.0883 1.0933 2.0834 1.1190 1.0961 6.9891 7.2806 6.0420 1.0645 1.0661 1.0677 1.0611 1.0843 1.0962 1.0977 1.1007 1.1053 1.0878 1.0869 1.0919 1.0961 1.1015
irintensity: 1.5348 0.0054 0.2636 0.0652 1.2013 0.0345 0.1415 3.2640 0.2375 5.6092 0.7707 2.3747 5.2586 0.1247 0.7658 9.3051 0.0158 1.4513 0.9307 4.8610 3.7060 29.0156 1.4398 0.1484 32.9105 5.5420 13.8031 53.2032 56.1260 8.5984 14.9079 3.5287 11.0533 4.1968 5.2929 6.4688 0.5997 1.6985 13.5906 3.6877 2.2890 16.1795 75.0950 62.0003 10.8101 176.3113 6.4355 18.7375 1.9218 21.1179 4.5112 8.9836 25.4853 40.3018 4.5575 127.2213 22.1173 28.5627 2.3852 2.9525 1.6471 24.2367 7.4838 10.2102 24.6346 15.0372 180.7392 12.1945 9.6664 17.1117 16.6633 3.5470 5.5928 100.2909 192.8231 5.4704 40.3143 20.9880 26.5645 23.0907 11.9304 16.4455 14.3967 24.5563 50.4256 7.9259 1.9193 20.0886 13.2340 21.3867
temp: 298.150 k
press: 1.00000 atm
elementType: 9 9 9 8 7 6 6 6 6 6 6 6 6 6 6 6 6 6 1 1 1 1 1 1 1 1 1 1 1 1 1 1
symmnumber: 1
zpe: 649788.4 jmol-1
zpe.correction: 0.247491 hartree
zpe.thermalcorrener: 0.264031 hartree
zpe.thermalcorrenthalpy: 0.264975 hartree
zpe.thermalcorrgfe: 0.200951 hartree
zpe.sumelectzpe: -931.965719 hartree
zpe.sumelectthermal: -931.949179 hartree
zpe.sumelectthermalent: -931.948235 hartree
zpe.sumelectthermalfe: -932.012259 hartree
dipole: -3.3248 -5.6005 -2.6446
dipole: 7.0295
quadrupole: -92.0859 -109.7253 -102.4934
quadrupole: -4.3308 4.4968 -1.8274
quadrupole: 9.3489 -8.2904 -1.0585 -4.3308 4.4968 -1.8274
hfenergy: -932.2132102 hartree
pointgroup: C01 [X(C13H14F3N1O1)]
dipole: 1.1301682 -2.2051347 1.2283184 debye
polarizability: 158.0795247|20.9125565|131.3692704|4.8090433|-7.7772625|140.2321331 unknown
InChI: InChI=1S/C13H14F3NO/c14-13(15,16)11(10-6-2-1-3-7-10)12(18)17-8-4-5-9-17/h1-3,6-7,11H,4-5,8-9H2
charge 0 multiplicity 1
32 atoms
F  0.119889 3.155051 0.367841
F  -1.478325 2.378202 -1.043508
F  -1.826728 2.336195 1.189963
O  1.054161 1.059263 -1.75789
N  2.069713 -0.136833 -0.052685
C  3.301972 -0.359375 -0.861653
C  2.136482 -0.81304 1.272812
C  4.294151 -0.963594 0.156829
C  3.375504 -1.732493 1.141508
C  1.024145 0.582823 -0.580369
C  -0.220486 0.736163 0.334618
C  -1.237413 -0.381549 0.074246
C  -0.842002 2.131564 0.17826
C  -1.793432 -1.097798 1.162582
C  -1.626705 -0.708175 -1.24966
C  -2.72895 -2.131933 0.934252
C  -2.562923 -1.740335 -1.474666
C  -3.115443 -2.455824 -0.386311
H  3.636789 0.592818 -1.305689
H  3.081935 -1.054371 -1.695063
H  1.213988 -1.38507 1.476112
H  2.279539 -0.070112 2.083985
H  4.833986 -0.157555 0.687212
H  5.0412 -1.614175 -0.326939
H  3.077374 -2.702273 0.702567
H  3.851182 -1.928329 2.116784
H  0.086525 0.699028 1.394868
H  -1.510723 -0.835756 2.18985
H  -1.197067 -0.151837 -2.089632
H  -3.157281 -2.677236 1.782416
H  -2.864031 -1.984486 -2.499338
H  -3.842822 -3.255358 -0.565707
