program: Gaussian 09
title: 000287236
version: EM64L-G09RevD.01
frameworkgroup: C1[X(C8H4N4O5)]
method: RPBEPBE
basis: SDD
operation: Freq
keyword: #pfreq=noraman
keyword: PBEPBE/SDD
title: #p freq=noraman PBEPBE/SDD
converged: NO YES YES YES
title: Mulliken charges:
elementType: O O O O O N N N N C C C C C C C C H H H H
charge: -0.172317 -0.218502 -0.218502 -0.236799 -0.236799 -0.348587 -0.348587 -0.319926 -0.319926 0.121798 0.121799 0.068309 0.068308 0.140103 0.140102 0.180236 0.180236 0.346865 0.346865 0.352662 0.352662
chargesum: 0.00000
title: Mulliken charges with hydrogens summed into heavy atoms:
elementType: O O O O O N N N N C C C C C C C C
charge: -0.172317 -0.218502 -0.218502 -0.236799 -0.236799 -0.001722 -0.001722 0.032736 0.032736 0.121798 0.121799 0.068309 0.068308 0.140103 0.140102 0.180236 0.180236
polarizability: 1.80126051e+02 3.13356383e-05 1.69803718e+02 -1.67672730e-03 -2.80596518e-03 5.03792422e+01
1716.lowfreq: -0.0010 -0.0010 0.0006 1.7231 3.9150 7.8927 45.0309 81.8337 95.0505
frequency: 45.0303 81.8331 95.0505 117.6612 140.3209 198.5299 221.9402 237.1204 264.0441 267.1387 269.0529 343.4806 348.7576 372.7184 425.1516 461.9319 478.9874 505.8741 547.2087 559.8814 560.4717 578.8118 581.4892 594.1713 646.5159 688.0245 692.8769 712.9753 729.8980 751.9845 782.0171 837.2650 978.5553 1029.8280 1033.3301 1098.9936 1168.3410 1182.8948 1244.5569 1276.1739 1314.8354 1325.6228 1370.7915 1372.3001 1447.0528 1460.5884 1475.7997 1486.1057 1510.0454 1624.2519 1637.4311 1655.4944 1674.0650 3538.6562 3538.7279 3547.9981 3548.6953
redmass: 10.9006 6.1669 10.8178 13.3561 11.7611 4.9606 12.4783 7.8620 14.1699 4.9809 14.5201 1.1733 13.3133 1.3191 10.6429 11.0665 9.8123 11.3821 1.6388 1.4042 7.6167 2.8046 3.9294 6.9425 5.7554 9.1020 10.3225 10.0039 12.0666 8.9193 12.0576 10.3532 9.1178 5.4433 4.3135 3.9595 4.5088 6.1742 7.3794 12.4501 7.0602 8.4115 1.3761 1.3691 2.3570 1.8378 9.3857 4.8428 10.9767 5.9927 6.2642 7.8209 7.8954 1.0800 1.0800 1.0796 1.0797
irintensity: 0.0000 17.8652 0.0000 3.6885 2.6962 0.4766 0.0000 0.0177 0.7878 0.0000 0.1493 0.0000 33.3630 1.8770 1.5907 1.9246 6.8666 0.0540 268.4572 0.0000 0.6229 226.5993 0.0000 1.1030 1.2491 105.2189 0.0000 0.0773 0.0908 0.1744 0.0000 5.2804 3.6728 199.4169 8.0541 89.6148 133.2703 7.4692 2.6647 69.4553 0.4491 1.0231 0.2101 0.9908 3.0979 0.0032 15.3063 32.8583 8.7461 75.4907 1134.5198 53.5032 0.5218 7.9839 16.1130 335.2804 19.9425
temp: 298.150 k
press: 1.00000 atm
elementType: 8 8 8 8 8 7 7 7 7 6 6 6 6 6 6 6 6 1 1 1 1
symmnumber: 1
zpe: 339017.8 jmol-1
zpe.correction: 0.129125 hartree
zpe.thermalcorrener: 0.142887 hartree
zpe.thermalcorrenthalpy: 0.143832 hartree
zpe.thermalcorrgfe: 0.088505 hartree
zpe.sumelectzpe: -901.140816 hartree
zpe.sumelectthermal: -901.127053 hartree
zpe.sumelectthermalent: -901.126109 hartree
zpe.sumelectthermalfe: -901.181436 hartree
dipole: 0.0000 -2.2001 0.0002
dipole: 2.2001
quadrupole: -50.4473 -138.2270 -94.6059
quadrupole: 0.0000 -0.0004 0.0006
quadrupole: 43.9795 -43.8003 -0.1792 0.0000 -0.0004 0.0006
hfenergy: -901.2699408 hartree
pointgroup: C01 [X(C8H4N4O5)]
dipole: -0.0000081 -0.8655919 0.0000711 debye
dipolederiv: -0.4904804 -0.0000003 0.0000037 0.0000002 -0.4700773 0.0000148 0.0000204 0.0000162 -0.100278 -0.5001445 0.0016467 -0.0000141 -0.1007882 -1.1481056 -0.0000427 0.0000221 0.0000806 -0.3307725 -0.5001429 -0.0016569 0.0000167 0.100778 -1.1481066 -0.0000277 -0.0000257 0.0001247 -0.3307722 -0.6071108 -0.2985685 0.0000151 -0.2363117 -1.1878798 0.0000469 -0.0000157 -0.0000587 -0.3438098 -0.6071023 0.2985601 -0.0000042 0.2363034 -1.1878899 0.0000343 0.0000151 -0.0000222 -0.3438093 -0.458671 -0.4188027 0.000012 0.4434881 -0.3525734 0.00003 -0.0000478 -0.000039 -0.315838 -0.4586729 0.4188043 -0.0000704 -0.443487 -0.352574 0.0000408 -0.0000672 -0.0000586 -0.3158383 -0.5960089 0.4381319 0.0000212 -0.4216198 -0.3548291 -0.0000301 0.0000305 0.0000445 -0.3098075 -0.5960075 -0.4381287 0.00004 0.4216242 -0.3548294 -0.0000054 0.0000951 0.0000801 -0.3098079 0.0212369 0.1404689 -0.0000026 0.1407563 -0.2586582 0.0000019 0.0000212 0.0000039 0.0016906 0.0212287 -0.1404734 0.0000002 -0.1407594 -0.2586545 0.0000138 -0.0000161 0.0000125 0.0016905 -0.1564657 -0.3043322 0.0000172 -0.4130951 0.1490138 -0.0000011 0.0000191 -0.0000131 0.1009345 -0.1564539 0.3043371 -0.0000051 0.4130979 0.1490037 -0.0000072 -0.0000163 -0.0000252 0.1009345 0.9853879 0.4241107 0.0000107 0.0191848 1.46476 0.0000309 -0.000021 -0.0000411 0.2552439 0.9853817 -0.4241027 -0.0000002 -0.0191768 1.4647668 -0.0000048 0.0000151 -0.0000831 0.2552437 1.026904 0.0417341 -0.0000183 0.3527059 1.6406013 -0.0000499 -0.0000089 0.0000049 0.240279 1.0268976 -0.041725 -0.0000274 -0.3526971 1.6406107 -0.0000541 -0.0000279 -0.0000307 0.2402796 0.2356895 -0.0674535 -0.0000084 -0.0670803 0.1571469 0.0000014 0.0000051 0. 0.3738314 0.2356921 0.0674525 0.0000232 0.0670793 0.1571449 -0.0000014 0.000052 0.0000074 0.3738316 0.2944216 0.0031019 -0.0000137 0.0087453 0.1255647 0.0000085 -0.0000176 0.000009 0.3783873 0.2944207 -0.0031043 0.0000045 -0.0087478 0.1255651 0.000001 -0.0000316 -0.0000119 0.3783869 unknown
polarizability: 180.1260511|-0.0000481|169.8037179|-0.0016767|-0.002806|50.3792422 unknown
InChI: InChI=1S/C8H4N4O5/c13-5-1-2-4(8(16)12-10-6(2)14)17-3(1)7(15)11-9-5/h9-12H
charge 0 multiplicity 1
21 atoms
O  0.000009 1.689013 -0.000007
O  1.567636 -2.827036 0.000134
O  -1.567688 -2.827012 0.000234
O  2.847356 2.582602 0.000047
O  -2.847323 2.582646 0.000112
N  3.052545 -1.054037 0.000109
N  -3.05257 -1.053989 0.000173
N  3.398289 0.315786 0.000099
N  -3.398291 0.315839 0.000212
C  0.724238 -0.503072 0.000024
C  -0.724254 -0.503061 0.000035
C  1.109643 0.842638 -0.000009
C  -1.109637 0.842655 0.000044
C  1.741147 -1.579252 0.000008
C  -1.74118 -1.579225 0.000055
C  2.477736 1.375077 -0.000015
C  -2.477722 1.375116 0.00009
H  3.826246 -1.723714 0.000167
H  -3.826281 -1.723654 0.000328
H  4.395611 0.544704 0.00021
H  -4.39561 0.544773 0.000255
