program: Gaussian 09
title: 000287243
version: EM64L-G09RevD.01
frameworkgroup: C1[X(C11H9NO5)]
method: RPBEPBE
basis: SDD
operation: Freq
keyword: #p
keyword: freq=noraman
keyword: PBEPBE/SDD
title: #p freq=noraman PBEPBE/SDD
converged: YES YES NO NO
title: Mulliken charges:
elementType: O O O O O N C C C C C C C C C C C H H H H H H H H H
charge: -0.250097 -0.209946 -0.175313 -0.192193 -0.212888 0.015044 -0.230423 0.361904 -0.288161 0.176259 0.135946 -0.308989 0.123889 -0.347312 -0.222885 -0.213078 -0.521902 0.288838 0.297275 0.282225 0.286213 0.244820 0.246948 0.255102 0.231834 0.226891
chargesum: 0.00000
title: Mulliken charges with hydrogens summed into heavy atoms:
elementType: O O O O O N C C C C C C C C C C C
charge: -0.250097 -0.209946 -0.175313 -0.192193 -0.212888 0.015044 0.058415 0.361904 0.009114 0.176259 0.135946 -0.026764 0.123889 -0.061100 0.021935 0.033869 0.191925
polarizability: 1.98007942e+02 7.27732613e+00 1.50915311e+02 -7.94264580e+00 9.86734087e+00 8.74497990e+01
1716.lowfreq: -3.7011 -0.0009 -0.0006 -0.0005 3.8852 7.6091 32.3932 48.2039 76.0872
frequency: 32.3615 48.1975 76.0869 86.8205 119.5922 131.6526 177.9129 190.5332 195.2990 231.1206 268.1030 293.4895 315.8447 352.1203 391.8904 423.1698 441.6207 498.4180 531.2397 559.8893 602.9633 618.9244 661.1986 671.0404 717.4918 728.8374 755.1157 771.8929 775.3360 789.8452 811.0209 837.6751 900.9922 903.8930 932.2126 981.8426 1007.1060 1026.7330 1035.2631 1049.3489 1062.6006 1116.6105 1138.5220 1156.8251 1174.7242 1190.4774 1203.2350 1213.3653 1227.6430 1265.7854 1295.6674 1298.8867 1365.7185 1390.7342 1432.1783 1433.5598 1463.9583 1466.6039 1470.2133 1578.9644 1608.1906 1633.5085 1721.4310 2971.3965 3040.4968 3063.9493 3144.2646 3147.7656 3165.6176 3183.4310 3189.1209 3237.0845
redmass: 7.7658 5.3965 8.1762 6.1640 4.1842 4.1752 1.4933 8.6695 4.6860 2.2867 7.0948 6.7212 7.2273 5.0456 7.2413 4.0396 5.2303 4.5160 6.4949 9.8992 4.6369 6.0484 7.8550 5.3144 4.9171 7.3910 4.4943 6.1261 3.6408 1.4427 3.3697 2.3275 1.6926 3.6325 6.0968 1.3740 1.3593 4.7948 2.7284 2.6887 3.0439 1.2617 2.0340 1.3254 1.2157 1.8246 2.0659 2.5234 2.5302 1.8736 1.4649 3.0985 6.8343 6.8629 1.9089 1.3444 1.0490 1.0548 2.4818 6.5029 6.6902 7.8945 12.9137 1.0324 1.0838 1.1045 1.1008 1.0874 1.0923 1.0939 1.0982 1.0972
irintensity: 4.1167 1.2901 6.4814 2.1784 2.1574 1.9208 0.7413 1.8237 0.0261 1.2232 0.6651 1.5191 6.2775 4.0031 2.8402 0.3453 3.5425 3.1306 0.4758 0.7098 2.4588 6.6034 10.9963 13.5721 20.6877 3.4272 12.8057 2.0804 6.6931 64.5531 21.0941 25.9227 24.7089 81.6729 0.5147 2.7520 0.9641 170.5019 85.6268 37.9413 8.0780 0.0563 0.6603 7.5603 31.7793 14.7423 109.3101 139.9007 59.7144 2.9492 24.9699 15.3034 154.3307 9.9068 1.1968 17.5238 17.6597 27.8654 37.6253 16.2410 9.1725 169.2004 441.4697 35.6736 3.0050 37.6074 15.6050 3.4965 9.2728 0.1412 8.6338 9.4060
temp: 298.150 k
press: 1.00000 atm
elementType: 8 8 8 8 8 7 6 6 6 6 6 6 6 6 6 6 6 1 1 1 1 1 1 1 1 1
symmnumber: 1
zpe: 484467.4 jmol-1
zpe.correction: 0.184524 hartree
zpe.thermalcorrener: 0.199228 hartree
zpe.thermalcorrenthalpy: 0.200172 hartree
zpe.thermalcorrgfe: 0.141670 hartree
zpe.sumelectzpe: -854.102708 hartree
zpe.sumelectthermal: -854.088004 hartree
zpe.sumelectthermalent: -854.087060 hartree
zpe.sumelectthermalfe: -854.145562 hartree
dipole: -2.3692 -0.3433 4.5921
dipole: 5.1786
quadrupole: -104.2256 -99.6723 -95.6769
quadrupole: -26.7116 3.7324 1.1159
quadrupole: -4.3673 0.1860 4.1813 -26.7116 3.7324 1.1159
hfenergy: -854.287232 hartree
pointgroup: C01 [X(C11H9N1O5)]
dipole: -1.006178 0.3398238 1.7387559 debye
dipolederiv: -1.2815474 -0.1262907 -0.0079719 -0.0833532 -0.343901 0.0976543 -0.216288 0.0462278 -0.4562801 -1.0275163 0.2099531 -0.4559054 0.2257714 -0.3635457 0.2322229 -0.7614842 0.2605525 -0.7930256 -1.037634 -0.2552455 0.1524239 -0.5064851 -0.5410403 0.1961732 0.2713679 0.1923185 -0.4792625 -0.8589511 -0.2515753 -0.0431297 -0.271842 -0.6223967 -0.0275994 -0.0176935 -0.0055002 -0.2135822 -0.7816652 0.1561332 -0.0125302 0.1728287 -0.6817026 -0.0174618 0.0032566 -0.0411498 -0.2108707 1.3524036 0.1471884 0.0961093 0.1542067 1.587186 0.0739848 0.0330701 0.0746815 0.1641209 0.4725644 -0.014096 -0.0693448 0.1721471 0.2957067 -0.0311978 -0.3193437 -0.0107074 0.3545805 0.2544665 0.1765133 0.0024024 -0.2833381 0.1590626 0.058344 -0.0660106 0.0337743 -0.0400148 -0.3635494 0.1977948 -0.2066017 -0.0653876 -0.1302652 -0.1576478 0.3096454 -0.0463198 -0.1949278 0.0160235 -0.0637499 -0.046252 -0.0637729 -0.614824 -0.0412315 -0.0095352 -0.0258362 0.0440899 0.9739374 -0.3090262 0.7124606 -0.1375596 -0.0881001 0.150504 0.6947229 0.0357203 0.2753664 -0.1620038 0.1682905 -0.0140567 0.2918893 -0.2268393 -0.0415469 0.0052704 -0.0672815 -0.0902284 1.8293216 0.4777822 -0.1547112 0.6567557 0.6910064 -0.4033181 -0.0432439 -0.3498856 0.7023582 -0.1297626 -0.1588832 -0.0253662 0.1800849 0.1378843 -0.0067661 0.0355325 0.0087768 -0.0876032 0.1560285 0.011805 -0.0432444 0.0164545 0.2225118 0.0172179 -0.0697952 0.0158155 -0.0891179 -0.0357305 -0.1827309 -0.0711372 -0.2602393 -0.1569361 0.0496488 -0.0547684 0.0373874 -0.1217137 0.2252688 -0.0313264 -0.0117843 -0.2647111 0.4137551 -0.2082102 0.2932268 -0.1528257 0.5736967 -0.0166161 -0.0439814 -0.0107848 0.0067959 0.0160616 -0.0229838 -0.0717215 -0.0227379 0.0150463 0.1755341 -0.0508963 0.0084036 -0.0092054 0.1006986 0.0958711 -0.0046751 0.0681786 0.0729742 0.061187 -0.068231 0.0246465 -0.0834468 0.0881329 -0.0030462 0.0139041 0.0056927 0.1353546 0.0601197 -0.0173264 0.0324418 -0.0552834 0.0984407 0.012201 0.0180537 0.0167031 0.1633799 0.0926944 -0.0109209 0.0158187 0.0105124 -0.0789903 -0.0172609 0.0214639 -0.0078228 0.1452294 -0.0239324 0.0806141 0.0557406 0.0694657 0.0382422 -0.0290863 0.0589879 -0.027309 0.1413574 -0.0631002 0.015931 -0.1121069 -0.0086896 0.1082198 0.0193846 -0.0936973 0.0339163 0.0440098 0.1147294 -0.0942071 0.0137696 0.0349428 -0.122294 0.0074018 -0.0499057 -0.0739931 -0.0080498 -0.0022698 0.0364819 0.1707103 0.1014591 0.0139266 -0.0032517 0.0196602 0.0016237 -0.0468874 unknown
polarizability: 198.7890889|4.6292246|151.5466297|-4.5859895|-6.5587688|86.0373332 unknown
InChI: InChI=1S/C11H9NO5/c1-16-10-6-9(17-11(10)13)7-4-2-3-5-8(7)12(14)15/h2-6,9H,1H3
charge 0 multiplicity 1
26 atoms
O  1.306239 0.692064 -1.400525
O  3.651855 -0.336284 1.163187
O  3.520276 1.428322 -1.192172
O  -3.432828 -2.119709 -0.031581
O  -1.170622 -2.361728 0.010103
N  -2.24163 -1.629551 0.009211
C  0.423033 -0.26337 -0.668569
C  -0.843747 0.477272 -0.221606
C  1.284129 -0.785698 0.472567
C  -2.084699 -0.15713 0.074646
C  2.519406 -0.211117 0.39526
C  -0.811662 1.890349 -0.121325
C  2.593005 0.725997 -0.772145
C  -3.236877 0.573946 0.452662
C  -1.946161 2.630219 0.272479
C  -3.165759 1.973104 0.560245
C  3.545563 -1.272493 2.295269
H  0.176035 -1.072561 -1.377382
H  0.90604 -1.523874 1.17636
H  0.113733 2.406614 -0.387418
H  -4.161527 0.0267 0.653548
H  -1.879961 3.720903 0.343082
H  -4.049491 2.544574 0.860029
H  4.526054 -1.243851 2.789698
H  3.327977 -2.294858 1.932263
H  2.752919 -0.945537 2.995115
