program: Gaussian 09
title: 000287239
version: EM64L-G09RevD.01
frameworkgroup: C1[X(C9H10N2O4)]
method: RPBEPBE
basis: SDD
operation: Freq
keyword: #p
keyword: freq=noraman
keyword: PBEPBE/SDD
title: #p freq=noraman PBEPBE/SDD
converged: YES YES NO NO
title: Mulliken charges:
elementType: O O O O N N C C C C C C C C C H H H H H H H H H H
charge: -0.288913 -0.239140 -0.197905 -0.197742 -0.025642 0.032502 0.121231 0.091480 -0.322392 0.361740 0.188057 -0.731317 -0.427193 -0.256920 -0.661685 0.333683 0.250425 0.251158 0.249121 0.298029 0.230482 0.237426 0.224010 0.248063 0.231443
chargesum: 0.00000
title: Mulliken charges with hydrogens summed into heavy atoms:
elementType: O O O O N N C C C C C C C C C
charge: -0.288913 -0.239140 -0.197905 -0.197742 -0.025642 0.032502 0.121231 0.091480 0.011291 0.361740 0.188057 0.019386 -0.129164 0.210987 0.041832
polarizability: 1.78643054e+02 5.73031931e+00 1.51123262e+02 -4.08736849e+00 3.68151195e+00 6.56795594e+01
1716.lowfreq: -10.6723 -7.2714 -0.0008 0.0001 0.0008 4.8067 21.9040 44.5243 59.5034
frequency: 21.1141 44.5154 59.4998 75.2169 86.4863 113.6589 155.0432 158.7286 197.0664 237.1735 279.6599 300.1055 317.9482 340.4655 381.4213 398.2431 438.7108 466.6904 482.2944 540.5253 622.8338 667.8364 671.0156 719.6042 741.9479 761.8663 763.4379 803.5309 820.9989 906.7755 952.6325 982.1690 982.7746 997.8382 1036.8214 1042.9352 1094.9018 1103.9250 1154.9780 1191.9160 1208.6247 1232.5582 1255.1854 1278.4284 1314.4432 1353.4051 1365.5509 1390.9705 1391.8261 1398.4235 1423.7806 1447.9436 1449.9149 1457.5995 1462.6850 1483.6588 1538.8253 1580.3882 1621.6722 2995.5567 3001.3695 3034.8606 3077.3593 3091.2010 3097.2562 3123.4971 3131.6441 3167.9235 3199.6106
redmass: 4.0791 7.9331 5.0401 4.4503 4.0462 3.7697 2.8507 1.2496 1.7472 2.0303 4.6097 5.2309 3.6304 8.4373 5.6100 3.9101 4.6901 4.2132 3.5340 4.9479 9.0074 7.1703 9.1171 4.5520 4.0519 4.8871 4.9351 2.1136 1.9989 5.0845 1.5232 1.4438 1.7629 2.7837 3.9456 1.6381 2.1579 2.4708 1.6748 4.7750 3.7282 3.6056 2.1384 1.1159 7.0099 1.3842 4.2960 1.2417 3.2141 1.2152 3.4403 1.2138 1.0524 1.0975 1.0438 1.0519 7.7939 7.2980 9.8415 1.0360 1.0374 1.0596 1.0946 1.0974 1.1031 1.1066 1.1014 1.0929 1.0928
irintensity: 0.8054 0.0517 0.9730 0.0420 0.0082 1.3610 2.9289 4.6543 4.0870 0.3057 4.3812 3.8992 9.2680 6.5864 0.8015 1.8209 2.4928 1.7633 9.2808 7.2973 2.6583 16.4650 12.3180 5.7475 2.7147 10.1675 11.7415 7.8252 2.0122 10.3958 8.2251 11.0421 7.9287 3.2325 247.3750 11.2922 31.7852 80.6748 29.1594 177.3076 200.8963 110.6885 90.2630 1.6189 16.7152 9.6414 100.8475 21.6432 15.7510 33.6670 42.6980 26.8639 16.7138 16.6197 16.3459 13.6605 44.8729 49.6710 212.7779 16.8388 0.3318 28.6727 5.1876 33.8331 1.3803 24.9296 15.8965 0.6831 9.5173
temp: 298.150 k
press: 1.00000 atm
elementType: 8 8 8 8 7 7 6 6 6 6 6 6 6 6 6 1 1 1 1 1 1 1 1 1 1
symmnumber: 1
zpe: 482642.2 jmol-1
zpe.correction: 0.183829 hartree
zpe.thermalcorrener: 0.198486 hartree
zpe.thermalcorrenthalpy: 0.199430 hartree
zpe.thermalcorrgfe: 0.140127 hartree
zpe.sumelectzpe: -758.165747 hartree
zpe.sumelectthermal: -758.151090 hartree
zpe.sumelectthermalent: -758.150146 hartree
zpe.sumelectthermalfe: -758.209449 hartree
dipole: 4.3722 0.2463 -0.0835
dipole: 4.3800
quadrupole: -93.7340 -92.9101 -84.7460
quadrupole: -13.9295 -0.0494 -0.1240
quadrupole: -3.2706 -2.4467 5.7174 -13.9295 -0.0494 -0.1240
hfenergy: -758.3495758 hartree
pointgroup: C01 [X(C9H10N2O4)]
dipole: -1.7212161 0.0494887 -0.0664059 debye
dipolederiv: -1.015756 -0.4597078 0.0411143 -0.7617369 -1.1268159 0.1645378 0.2165501 0.2604845 -0.3883568 -0.8405446 0.2380031 -0.0653795 -0.0516091 -0.7257647 0.1046315 0.0235051 0.1313253 -0.3185991 -0.511454 0.0080678 0.0016904 0.0521318 -0.7951151 0.1670079 -0.0082932 0.1634746 -0.2694372 -0.9062127 0.0170719 0.0059399 0.0836386 -0.4507622 0.0666244 -0.0073504 0.065959 -0.2391499 -0.7263978 0.3547171 -0.0959309 0.147614 -0.3720802 0.0272896 -0.0273723 0.0222477 -0.2607826 1.4485551 -0.2853035 0.0601162 -0.4136658 1.284282 -0.3112679 0.0884117 -0.3057267 0.281794 -0.5361393 -0.0589402 0.016047 0.1622042 -0.4944834 0.1318812 -0.0400346 0.1425902 -0.0327482 0.5039742 -0.3973384 0.0985929 -0.2038413 0.6560497 -0.1490392 0.0436187 -0.1579485 0.1158494 0.3639227 -0.192027 0.0460031 -0.1043977 0.0073971 -0.0138719 0.0270657 -0.0079533 -0.032629 -0.5002462 0.2143283 -0.0515608 0.139105 -0.4059163 0.1340779 -0.0234646 0.1363952 0.0390578 1.5381209 0.0892582 -0.0252923 0.687947 1.4365195 -0.3051768 -0.2329416 -0.3919105 0.3148321 -0.2118169 0.3930299 -0.1053711 0.1810382 -0.1608624 0.0413164 -0.0541268 0.0499245 -0.0137563 0.2289522 -0.0274581 0.0005657 -0.1122826 0.3906852 -0.106357 0.0250832 -0.1055675 0.0448085 0.8008795 0.40364 -0.0273033 0.2742919 0.4265906 0.0192769 -0.0254751 -0.0392992 0.3412095 -0.0949714 -0.1059808 -0.0290741 -0.0618637 -0.0005273 -0.0474638 -0.0442748 -0.0165179 -0.1153325 0.2037077 0.0114077 0.0008789 -0.0326075 0.1016559 0.0137359 0.007272 0.0148143 0.1533201 0.0432418 -0.149033 0.0399515 -0.043802 -0.0275593 0.038245 0.0140536 0.0377332 0.1077077 0.0864779 -0.0303914 -0.0765193 -0.0072704 0.0534991 -0.0468856 -0.0872576 -0.0260595 0.0162159 0.085517 0.0105186 0.0820967 0.0375079 0.0727738 0.0142594 0.0814355 -0.0122694 -0.008339 0.0263878 0.0032629 0.0021004 0.0025496 0.1328404 0.0014089 0.0002919 -0.0001216 0.1387233 0.013773 -0.0291734 -0.0434448 -0.0572493 -0.013454 0.1125778 -0.0023606 0.0897204 -0.0427087 -0.0411028 -0.0324441 0.0407796 0.0823851 -0.0263619 -0.1033739 0.0034896 -0.0474037 0.0440466 -0.1358142 -0.1143756 0.0282934 -0.1115465 0.0653413 0.0017274 0.0114578 -0.018441 0.0937784 0.1371062 0.0064497 0.0076397 0.0199931 -0.0142203 0.1173936 0.0009179 0.0692848 -0.0155194 0.03984 0.1324179 0.0480663 0.0914661 -0.0137119 -0.0725552 0.0097988 -0.0547348 0.0460153 unknown
polarizability: 178.9780684|-4.5021127|145.6385784|2.7452759|-20.9218037|70.8292287 unknown
InChI: InChI=1S/C9H10N2O4/c1-3-15-9(12)8-4-7(11(13)14)5-10-6(8)2/h4-5H,3H2,1-2H3
charge 0 multiplicity 1
25 atoms
O  -2.083443 -1.077975 0.716889
O  -2.786675 1.031942 0.018177
O  2.468735 -2.45421 0.957059
O  4.154518 -0.983562 0.496435
N  1.450066 2.058317 -0.311517
N  2.906265 -1.289612 0.613226
C  -0.391316 0.513755 0.170057
C  0.098234 1.811754 -0.209653
C  0.539671 -0.516098 0.444779
C  1.909757 -0.23029 0.332455
C  -1.858504 0.226685 0.27651
C  -0.788309 2.990415 -0.520962
C  2.334728 1.062402 -0.048503
C  -3.513172 -1.508501 0.840375
C  -4.033061 -2.042906 -0.496472
H  0.199546 -1.511173 0.737726
H  -0.151225 3.85461 -0.75991
H  -1.464242 2.77183 -1.366552
H  -1.453624 3.230064 0.327236
H  3.399776 1.294564 -0.141723
H  -3.477035 -2.28997 1.615555
H  -4.107297 -0.646691 1.19065
H  -5.05568 -2.440983 -0.361113
H  -4.074759 -1.242004 -1.253289
H  -3.393057 -2.859961 -0.871034
