program: Gaussian 09
title: 000287229
version: EM64L-G09RevD.01
frameworkgroup: C1[X(C10H11N5O)]
method: RPBEPBE
basis: SDD
operation: Freq
keyword: #p
keyword: freq=noraman
keyword: PBEPBE/SDD
title: #p freq=noraman PBEPBE/SDD
converged: NO YES NO NO
title: Mulliken charges:
elementType: O N N N N N C C C C C C C C C C H H H H H H H H H H H
charge: -0.178484 0.010779 0.052710 0.064640 -0.060924 -0.368073 0.097893 0.114557 0.012241 -0.087198 -0.344243 -0.771502 -0.767079 -0.000140 0.211672 -0.794864 0.267880 0.258693 0.230948 0.230970 0.229529 0.270260 0.229509 0.342616 0.239273 0.269062 0.239274
chargesum: 0.00000
title: Mulliken charges with hydrogens summed into heavy atoms:
elementType: O N N N N N C C C C C C C C C C
charge: -0.178484 0.010779 0.052710 0.064640 -0.060924 -0.025457 0.097893 0.114557 0.012241 -0.087198 -0.076363 -0.050890 -0.037781 -0.000140 0.211672 -0.047255
polarizability: 2.69931636e+02 1.23968781e+01 1.47012914e+02 -1.37701666e-02 -4.36150212e-03 7.16095199e+01
1716.lowfreq: -12.3879 -8.0501 -0.0010 -0.0008 0.0008 9.4180 29.1019 35.0489 56.4097
frequency: 28.2340 34.7733 56.3760 68.2615 94.0624 95.2633 120.3266 157.5572 206.5835 233.6751 278.4800 288.9552 295.6798 356.0796 371.5194 438.6066 451.4621 473.3083 490.1993 521.6827 569.1522 574.1654 622.0698 640.8885 664.0950 705.5829 712.8859 757.6380 794.4311 828.9282 831.1512 914.2662 925.2290 945.1897 984.8149 1004.1446 1018.7950 1022.8839 1033.5548 1054.0501 1145.9953 1177.8764 1200.2015 1212.6079 1228.6656 1323.9723 1328.0710 1372.6050 1374.7204 1383.4889 1392.1006 1397.4642 1428.7937 1442.5631 1450.1092 1454.5073 1461.9692 1467.5481 1467.6816 1476.5290 1491.2012 1537.2582 1567.6522 1665.4784 2980.1202 2980.6928 2987.6664 3054.2700 3055.1128 3073.3787 3119.1274 3126.8167 3140.4687 3144.9450 3516.1506
redmass: 2.2280 2.2074 1.9476 1.1057 5.4133 3.9278 3.0387 1.1661 5.2683 5.1441 2.8067 5.0450 3.1002 5.5633 4.9528 4.2444 5.3116 5.0146 6.0305 4.2253 5.4796 2.9912 6.9036 3.4949 6.6329 7.2589 1.4604 3.2013 4.6012 7.3417 6.7433 2.7951 6.2256 1.5005 1.6908 1.9088 1.4218 2.3990 1.6910 1.7343 4.2258 4.2159 4.9395 3.5668 3.3373 2.5788 3.9420 2.6324 1.4687 2.0288 2.2797 1.3304 1.6386 1.4120 1.8171 1.0482 1.5386 1.0467 1.0461 2.4232 1.9783 5.6563 6.0653 7.0321 1.0391 1.0386 1.0381 1.0963 1.0964 1.0983 1.0982 1.0981 1.0982 1.0936 1.0760
irintensity: 3.4907 1.2522 4.8611 0.0064 5.9573 1.5424 1.7257 0.2969 0.1554 0.8555 0.7466 0.5143 0.8892 1.8921 1.1035 7.0349 3.1014 1.2815 5.6969 4.1829 12.7467 1.4188 14.5942 2.0408 2.4367 0.0769 48.3082 37.1036 16.6144 13.0904 6.5928 15.3291 5.5479 16.9636 78.4666 5.1196 5.2815 0.4481 9.5604 0.0148 12.5460 17.8085 121.4506 175.4366 13.7923 75.0614 31.5755 11.7735 86.6893 88.2180 48.8016 67.5248 19.1725 226.1909 56.5665 0.2023 46.9124 13.2071 47.7123 743.5227 255.3576 47.3446 165.5830 124.4867 6.1455 22.6340 6.5061 29.0202 0.0005 14.0433 9.4961 5.3168 8.5703 8.2456 46.8758
temp: 298.150 k
press: 1.00000 atm
elementType: 8 7 7 7 7 7 6 6 6 6 6 6 6 6 6 6 1 1 1 1 1 1 1 1 1 1 1
symmnumber: 1
zpe: 534089.6 jmol-1
zpe.correction: 0.203424 hartree
zpe.thermalcorrener: 0.218580 hartree
zpe.thermalcorrenthalpy: 0.219524 hartree
zpe.thermalcorrgfe: 0.159201 hartree
zpe.sumelectzpe: -735.506100 hartree
zpe.sumelectthermal: -735.490944 hartree
zpe.sumelectthermalent: -735.490000 hartree
zpe.sumelectthermalfe: -735.550323 hartree
dipole: 1.9904 -3.1656 0.0037
dipole: 3.7393
quadrupole: -60.4007 -103.3087 -92.1786
quadrupole: 15.5764 -0.0183 0.0041
quadrupole: 24.8953 -18.0127 -6.8826 15.5764 -0.0183 0.0041
hfenergy: -735.7095239 hartree
pointgroup: C01 [X(C10H11N5O1)]
dipole: 0.7933466 -1.2389247 0.0000535 debye
polarizability: 269.7183511|13.4108939|147.2260744|0.0471347|0.0956505|71.6096444 unknown
InChI: InChI=1S/C10H11N5O/c1-5-6(2)13-9-8(12-5)4-11-10(15-9)14-7(3)16/h4,14H,1-3H3
charge 0 multiplicity 1
27 atoms
O  -3.513857 1.890819 -0.002359
N  2.372923 -1.281085 -0.002896
N  1.337756 1.410979 0.002225
N  -0.876905 0.560815 0.000755
N  -1.258601 -1.877069 -0.00343
N  -3.060947 -0.43214 -0.001215
C  3.196982 -0.211653 -0.00108
C  2.66381 1.151937 0.001572
C  1.014333 -1.020502 -0.002206
C  0.481516 0.319234 0.000238
C  0.064953 -2.094072 -0.003832
C  4.684118 -0.469036 -0.001839
C  3.595122 2.34014 0.003682
C  -1.664986 -0.530181 -0.001293
C  -3.913103 0.704141 -0.001558
C  -5.391643 0.304378 -0.001375
H  0.420046 -3.130473 -0.005437
H  4.865281 -1.554441 -0.004235
H  5.171909 -0.022361 -0.888949
H  5.172157 -0.02628 0.887103
H  4.255318 2.335812 -0.884561
H  2.999967 3.264963 0.005674
H  4.255846 2.33229 0.89151
H  -3.50789 -1.354311 -0.001825
H  -5.641514 -0.294847 -0.896814
H  -6.00278 1.21769 -0.001358
H  -5.641308 -0.294849 0.894104
