program: Gaussian 09
title: 000287238
version: EM64L-G09RevD.01
frameworkgroup: C1[X(C17H16O)]
method: RPBEPBE
basis: SDD
operation: Freq
keyword: #pfreq=noraman
keyword: PBEPBE/SDD
title: #p freq=noraman PBEPBE/SDD
converged: YES YES NO NO
title: Mulliken charges:
elementType: O C C C C C C C C C C C C C C C C C H H H H H H H H H H H H H H H H
charge: -0.178481 -0.016486 -0.528281 -0.439441 -0.494609 0.060915 0.419126 0.438287 -0.345612 -0.387783 -0.428275 -0.401734 -0.244294 -0.236430 -0.242221 -0.238522 -0.244188 -0.246108 0.247462 0.213213 0.230900 0.226190 0.253332 0.245852 0.255153 0.242310 0.234999 0.249868 0.224573 0.225857 0.222097 0.226561 0.226561 0.229208
chargesum: 0.00000
title: Mulliken charges with hydrogens summed into heavy atoms:
elementType: O C C C C C C C C C C C C C C C C C
charge: -0.178481 -0.016486 -0.067606 0.017649 0.004575 0.060915 0.419126 0.438287 -0.090458 -0.145474 -0.193276 -0.151866 -0.019720 -0.010572 -0.020124 -0.011961 -0.017627 -0.016900
polarizability: 2.00823885e+02 -1.95084435e+00 1.61357907e+02 -1.34240523e+01 -1.95112747e+00 1.56432198e+02
1716.lowfreq: -16.7274 -0.0008 0.0001 0.0006 4.8019 12.9255 25.9003 37.7569 59.5920
frequency: 25.2268 37.2596 59.5471 68.9674 113.8339 134.5246 171.9489 214.3012 240.2323 279.3984 286.4013 318.9877 355.7487 400.9690 403.4094 472.3244 481.1820 513.4576 543.3865 579.5006 609.5144 615.1036 620.1709 634.3792 677.7548 700.6429 704.2669 750.7900 766.9473 788.5478 831.1334 845.0831 850.6177 894.1039 903.1556 921.7829 932.1257 936.4977 970.9367 975.5761 989.2562 990.2892 991.9653 994.6555 1011.1433 1024.9962 1032.4355 1033.1455 1055.8707 1086.3533 1093.1280 1111.0844 1128.7558 1170.2607 1173.0352 1173.7023 1190.0594 1196.6775 1201.9953 1221.7632 1234.9295 1273.1157 1312.3499 1315.9551 1327.2246 1328.5604 1374.0509 1377.9196 1425.3290 1432.1114 1433.5919 1468.5760 1476.6290 1481.0350 1484.1791 1587.4493 1588.7373 1606.2675 1610.1467 1653.4177 2988.6883 2996.3303 3014.7069 3066.1245 3074.4551 3085.1544 3119.2395 3121.3892 3126.4094 3132.0276 3138.5208 3146.0441 3147.7624 3157.7112 3163.3850 3170.4138
redmass: 3.7596 3.9588 4.6564 3.6957 6.3548 3.2163 3.6589 2.9992 4.0344 3.6955 5.2785 3.4125 4.2369 2.8138 2.8054 3.5284 2.6545 3.3249 3.7967 4.1145 3.5329 6.3559 4.0089 4.8756 5.3216 1.6676 1.6353 2.2094 1.9698 2.1579 2.0243 1.2568 1.2550 3.1839 1.5310 1.5641 2.3466 1.9669 1.3958 1.3983 5.2230 5.1120 1.3195 1.4101 2.4707 2.1811 2.1334 1.8565 2.5462 1.6438 2.1547 1.8731 2.9123 1.3964 1.0572 1.1389 2.1713 1.1333 1.1730 3.3356 1.3503 1.4588 1.3887 1.3831 1.3535 1.3587 6.3239 7.3521 1.0804 2.2191 2.2555 1.1029 1.2134 1.8345 2.0267 5.8743 5.9964 5.9212 5.9976 12.2686 1.0650 1.0640 1.0625 1.0958 1.0989 1.1045 1.0855 1.0845 1.0869 1.0884 1.0922 1.0931 1.0957 1.0971 1.1015 1.0982
irintensity: 0.0867 0.2799 0.5133 4.1558 2.7972 0.6165 0.8361 1.4142 0.6850 0.0691 0.9009 0.1463 1.4676 0.2002 0.0605 3.6607 1.9626 5.2397 14.7306 18.1444 5.8633 0.5282 3.5276 9.6117 1.3592 53.5374 58.6177 22.9856 36.2267 2.8972 32.5120 0.3434 0.2669 5.1582 2.1820 1.4284 9.8249 3.2796 0.1090 0.1030 1.7833 0.8287 0.1176 0.6543 8.0802 15.0332 12.7625 0.5228 0.2855 0.4068 25.2365 22.1396 58.9626 1.9342 0.0898 1.0296 6.8831 1.9151 0.6475 5.6240 3.6291 5.6529 2.2845 1.4481 0.0574 3.1422 0.4319 0.5428 24.0196 2.6932 15.2163 11.4183 12.8125 26.2552 20.2084 3.8964 0.3422 14.2117 6.7611 113.8552 10.5737 26.7181 29.7581 11.1073 18.2856 46.0350 3.8545 1.1889 0.3527 7.9607 15.8810 36.1731 28.8301 32.9762 23.6586 6.3986
temp: 298.150 k
press: 1.00000 atm
elementType: 8 6 6 6 6 6 6 6 6 6 6 6 6 6 6 6 6 6 1 1 1 1 1 1 1 1 1 1 1 1 1 1 1 1
symmnumber: 1
zpe: 729364.7 jmol-1
zpe.correction: 0.277800 hartree
zpe.thermalcorrener: 0.292752 hartree
zpe.thermalcorrenthalpy: 0.293697 hartree
zpe.thermalcorrgfe: 0.234484 hartree
zpe.sumelectzpe: -731.360920 hartree
zpe.sumelectthermal: -731.345968 hartree
zpe.sumelectthermalent: -731.345024 hartree
zpe.sumelectthermalfe: -731.404236 hartree
dipole: -1.2133 0.1698 -2.6854
dipole: 2.9516
quadrupole: -98.3997 -99.7557 -105.7269
quadrupole: -1.6379 -4.7548 -5.2761
quadrupole: 2.8944 1.5384 -4.4328 -1.6379 -4.7548 -5.2761
hfenergy: -731.6387205 hartree
pointgroup: C01 [X(C17H16O1)]
dipole: 0.4851097 0.0738948 1.0524981 debye
polarizability: 200.1914758|4.2919184|161.6342599|-13.9351434|1.2728034|156.7882539 unknown
InChI: InChI=1S/C17H16O/c18-16-12-7-13-17(16,14-8-3-1-4-9-14)15-10-5-2-6-11-15/h1-6,8-11H,7,12-13H2
charge 0 multiplicity 1
34 atoms
O  -0.210135 1.804614 -2.017706
C  -0.012252 0.742106 0.256475
C  0.176542 1.556598 1.578744
C  1.241529 2.628561 1.231893
C  0.818433 3.097427 -0.178427
C  0.145509 1.875696 -0.819685
C  -1.352623 -0.001106 0.122242
C  1.162437 -0.268876 0.1031
C  -1.64775 -0.690893 -1.084957
C  1.26733 -1.32399 1.049055
C  -2.304296 -0.041856 1.172103
C  2.128936 -0.192355 -0.930268
C  -2.865517 -1.385298 -1.240132
C  2.314074 -2.265464 0.973102
C  -3.522801 -0.744419 1.020243
C  3.181891 -1.13529 -1.006739
C  -3.811029 -1.41593 -0.187912
C  3.282143 -2.172814 -0.055664
H  0.469155 0.917907 2.428722
H  -0.770346 2.065867 1.842973
H  2.248247 2.173844 1.20322
H  1.261564 3.450351 1.967458
H  1.635991 3.471109 -0.81902
H  0.060406 3.905119 -0.122934
H  -0.923018 -0.672118 -1.904189
H  0.508915 -1.420116 1.835233
H  -2.104228 0.465989 2.12105
H  2.061886 0.586923 -1.69694
H  -3.076691 -1.904297 -2.181976
H  2.370982 -3.075398 1.70925
H  -4.242987 -0.766127 1.846293
H  3.918249 -1.058513 -1.814821
H  -4.755535 -1.958591 -0.307698
H  4.095584 -2.904259 -0.117186
