program: Gaussian 09
title: 000287212
version: EM64L-G09RevD.01
frameworkgroup: C1[X(C11H9N3O2)]
method: RPBEPBE
basis: SDD
operation: Freq
keyword: #p
keyword: freq=noraman
keyword: PBEPBE/SDD
title: #p freq=noraman PBEPBE/SDD
converged: YES YES NO NO
title: Mulliken charges:
elementType: O O N N N C C C C C C C C C C C H H H H H H H H H
charge: -0.221229 -0.219417 -0.489488 0.019979 -0.013210 0.491921 0.463877 -0.418540 -0.350819 0.386342 -0.344474 -0.369870 -0.369806 -0.316566 -0.306739 -0.330521 0.310714 0.238464 0.275890 0.288694 0.288129 0.231667 0.264543 0.245532 0.244926
chargesum: 0.00000
title: Mulliken charges with hydrogens summed into heavy atoms:
elementType: O O N N N C C C C C C C C C C C
charge: -0.221229 -0.219417 -0.178773 0.019979 -0.013210 0.491921 0.463877 -0.180076 -0.074930 0.386342 -0.055780 -0.081741 -0.138139 -0.052023 -0.061207 -0.085595
polarizability: 3.16667963e+02 2.62947708e+00 1.45538487e+02 -7.77825648e+00 -1.26270208e-01 6.71608268e+01
1716.lowfreq: -9.5403 -3.4811 -0.0008 -0.0002 0.0002 9.8254 38.6642 43.3797 66.5563
frequency: 38.5996 43.3553 66.5511 91.1565 134.1417 185.6545 232.8459 264.3516 283.6770 339.4237 374.3686 418.6776 426.6800 488.0687 505.5255 514.2803 575.6170 592.1644 626.6794 647.6756 662.0823 670.5277 728.2953 733.0293 769.9356 805.1339 823.4862 829.9493 849.0181 868.6155 879.5088 952.3618 957.8041 967.1892 980.7243 993.4889 996.0747 1054.5353 1091.4043 1099.4672 1122.0343 1181.4810 1222.5828 1227.9759 1238.9361 1263.3097 1305.4412 1330.4373 1340.8346 1353.6268 1384.9775 1414.8270 1441.1209 1468.4842 1486.1771 1510.8330 1572.8299 1580.5832 1597.7538 1620.0130 3126.9411 3130.7233 3136.5226 3150.9210 3170.8547 3180.7973 3183.8064 3190.9858 3526.1144
redmass: 7.2570 4.7853 8.6361 5.3190 6.0614 7.5144 7.1678 6.3342 5.7422 4.2496 2.5930 3.0626 7.3333 2.7745 4.5480 3.0264 1.5662 6.1469 7.2074 6.3243 5.5823 6.2247 5.0600 3.5741 6.0355 2.9123 1.9084 1.3341 1.6192 1.4009 3.9669 1.5362 3.6991 1.5330 1.3380 1.6148 2.1568 2.1034 1.6148 2.9293 1.2901 1.4957 1.4514 3.4680 2.7683 1.7513 1.6664 2.5125 1.9605 5.1500 3.0593 2.8156 4.3469 2.0256 2.2856 3.4386 4.7966 5.6622 3.8925 6.4367 1.0879 1.0908 1.0900 1.0978 1.0892 1.0950 1.0946 1.0963 1.0755
irintensity: 2.8452 1.1123 1.3075 1.3467 2.0777 0.6402 3.3024 1.1766 5.6064 6.2336 1.2897 1.0863 2.3453 39.3688 38.7659 57.6035 57.9053 8.7978 0.8988 7.7122 13.4198 19.1801 9.3525 1.2009 13.1500 15.8059 66.5456 48.5366 20.2855 20.6382 13.5955 1.1125 6.8828 2.8220 1.9449 1.0097 0.2494 0.3010 1.9802 19.6095 23.2396 326.2321 21.3464 524.8567 54.1891 3.0022 4.1041 10.1603 118.9982 81.2337 95.9700 16.7142 15.1518 48.5290 13.0207 245.6681 119.1351 511.2242 39.0458 208.9013 9.6243 9.2758 20.8075 27.9004 1.9988 5.2099 2.3619 2.6816 31.3535
temp: 298.150 k
press: 1.00000 atm
elementType: 8 8 7 7 7 6 6 6 6 6 6 6 6 6 6 6 1 1 1 1 1 1 1 1 1
symmnumber: 1
zpe: 484631.4 jmol-1
zpe.correction: 0.184586 hartree
zpe.thermalcorrener: 0.197383 hartree
zpe.thermalcorrenthalpy: 0.198327 hartree
zpe.thermalcorrgfe: 0.143786 hartree
zpe.sumelectzpe: -738.070320 hartree
zpe.sumelectthermal: -738.057523 hartree
zpe.sumelectthermalent: -738.056579 hartree
zpe.sumelectthermalfe: -738.111120 hartree
dipole: 4.1591 3.7245 -0.1541
dipole: 5.5851
quadrupole: -140.4521 -81.7319 -93.8693
quadrupole: 4.1336 -2.5890 -1.8280
quadrupole: -35.1010 23.6192 11.4818 4.1336 -2.5890 -1.8280
hfenergy: -738.2549061 hartree
pointgroup: C01 [X(C11H9N3O2)]
dipole: 1.6338655 1.4632377 -0.1335104 debye
dipolederiv: -1.1285575 0.1471869 0.082604 0.4200257 -0.5324547 -0.0848788 0.1523427 -0.0778776 -0.2668578 -0.7498069 -0.1835749 -0.0113311 -0.5773085 -0.7901039 -0.09815 -0.0866054 -0.1061165 -0.2602394 -2.4843305 0.1077654 -0.0086269 0.0733951 -0.2486989 -0.0069581 0.0710225 -0.0225266 -0.3510796 2.5533623 0.2083543 -0.0831877 0.4213254 1.0867385 0.1755031 -0.0793483 0.1840269 0.2364271 -0.6265656 -0.0122431 0.0455242 0.1182855 -0.4242178 0.1009397 0.0542063 0.0807287 -0.2999883 2.1140328 0.1347845 -0.003306 0.6988139 0.1467454 0.0504259 -0.230438 0.0644176 0.1372434 1.7452635 -0.3172615 0.0082454 -1.0432192 0.3121393 -0.0850553 -0.1077591 -0.061542 0.1674527 -0.8864927 -0.0296585 0.0013411 0.3540012 0.0940896 0.0554588 0.0209815 0.0562522 -0.190074 -0.5459296 -0.0811494 -0.0355364 -0.7461707 -0.1334428 0.0426221 -0.0504723 0.0363693 -0.1470016 -1.3799707 -0.1694099 0.0184013 -0.3596748 -0.137127 -0.0270716 0.0591432 -0.0343409 0.0124626 0.4951193 0.0644444 -0.0061857 0.4380373 0.1014311 0.023793 0.0368685 0.0449157 -0.0745843 0.6572768 0.069355 -0.0211933 -0.1209191 0.0088895 0.0378966 -0.084489 0.0109194 -0.0777456 -0.8041615 0.0757235 0.0091955 0.0400884 -0.0059048 -0.0665898 0.0346966 -0.0716021 -0.1392107 -0.402445 0.1139832 -0.0588244 0.5183524 -0.2869771 0.0248234 -0.1218324 0.0230964 -0.1196108 0.5382024 0.0470645 -0.0986756 -0.1129881 0.2225501 -0.133019 -0.1083457 -0.1391989 0.0101275 0.4118694 -0.0997473 -0.0333808 -0.1481525 0.3151266 -0.1836588 -0.0296987 -0.14596 0.0160164 0.0908291 0.0060505 0.0092269 0.0911178 0.1436836 0.0135964 0.2193329 0.0080896 0.3093753 0.048002 -0.0869598 -0.0058508 -0.0610568 -0.051527 -0.0503146 0.0026437 -0.047862 0.1502455 0.0318293 0.0612584 0.0373793 0.0814428 0.0369829 -0.0334698 0.0545 -0.0283685 0.1343452 0.0763407 0.0652836 0.0235443 0.0102651 0.0863642 -0.0220571 0.0279751 -0.0174188 0.162328 0.1044576 -0.0351425 -0.008937 0.0068075 0.0483373 -0.0331852 -0.0254063 -0.0233257 0.1600153 0.1091968 0.0610731 -0.0073923 0.0204233 -0.0588298 0.1043456 0.0144436 0.0938263 0.1217599 0.0099978 -0.0612363 0.068713 -0.0621842 0.0807873 0.0409327 0.1060709 0.0329824 0.1199316 -0.0565061 -0.0863084 0.0709289 -0.0776785 0.0445584 0.0560312 0.0819138 0.0525658 0.0996388 0.0789862 0.0003644 0.0073242 0.0169709 -0.05914 0.0980395 -0.011746 0.0879492 0.0890227 unknown
polarizability: 316.4745702|2.43465|145.4181799|-10.4490221|-3.1510144|67.4745267 unknown
InChI: InChI=1S/C11H9N3O2/c15-14(16)11-3-1-9(2-4-11)13-10-5-7-12-8-6-10/h1-8,13H
charge 0 multiplicity 1
25 atoms
O  -5.167702 0.488173 0.30399
O  -4.58531 -1.662077 -0.206246
N  1.181973 1.156524 -0.099502
N  -4.288859 -0.424861 0.035742
N  4.914606 -0.930226 0.094758
C  -0.150249 0.712256 -0.053291
C  2.384045 0.418707 -0.044215
C  -1.163072 1.671517 0.255199
C  -0.537472 -0.628338 -0.352309
C  -2.872355 -0.03296 0.002592
C  -2.515249 1.307354 0.281729
C  -1.890669 -0.997304 -0.321845
C  3.573307 1.01934 -0.545285
C  2.497726 -0.871352 0.543687
C  4.791328 0.318131 -0.451539
C  3.765747 -1.489012 0.58154
H  1.300768 2.16841 -0.188968
H  -0.875808 2.703989 0.487318
H  0.210301 -1.364709 -0.654133
H  -3.299042 2.030012 0.522565
H  -2.205031 -2.016821 -0.560425
H  3.547735 2.011901 -1.00983
H  1.642098 -1.370723 1.003405
H  5.715653 0.764802 -0.834422
H  3.875134 -2.480635 1.035087
