program: Gaussian 09
title: 000287192
version: EM64L-G09RevD.01
frameworkgroup: C1[X(C10H12O)]
method: RPBEPBE
basis: SDD
operation: Freq
keyword: #pfreq=noraman
keyword: PBEPBE/SDD
title: #p freq=noraman PBEPBE/SDD
converged: YES YES NO NO
title: Mulliken charges:
elementType: O C C C C C C C C C C H H H H H H H H H H H H
charge: -0.175153 -0.130536 -0.230098 -0.339565 -0.512038 -0.164475 -0.527797 -0.455334 0.141606 -0.184673 -0.198901 0.242095 0.259225 0.258157 0.223604 0.239223 0.210201 0.244120 0.206166 0.212481 0.227422 0.229073 0.225194
chargesum: 0.00000
title: Mulliken charges with hydrogens summed into heavy atoms:
elementType: O C C C C C C C C C C
charge: -0.175153 0.111559 0.029127 -0.081407 -0.049211 0.045727 -0.077511 -0.015431 0.141606 0.044400 0.026293
polarizability: 1.03071407e+02 -9.80968035e-01 9.61332220e+01 4.33051138e+00 -1.12504180e+00 8.86915672e+01
1716.lowfreq: -17.8180 -0.0003 0.0001 0.0005 6.2599 37.1700 129.1605 218.9261 281.4680
frequency: 128.9835 218.9151 281.4655 331.5229 371.0738 407.9486 447.2587 461.5006 530.8520 549.6410 671.2239 673.7567 702.7490 709.2448 772.2156 802.6563 832.5740 852.0008 885.9221 895.4093 915.4739 946.8558 952.0835 965.6450 1011.5990 1028.8938 1044.9376 1046.0254 1075.3101 1113.3301 1121.0103 1129.8332 1148.1215 1185.9144 1193.9695 1204.5234 1240.8280 1261.8319 1272.6079 1283.4451 1298.5291 1311.5675 1329.2366 1332.9744 1339.6643 1362.3823 1458.9363 1465.4688 1487.7304 1635.8460 1663.2502 2971.0169 2988.7103 2994.5431 3018.5292 3040.9341 3042.8920 3054.4213 3057.5914 3061.6986 3064.0891 3124.7200 3158.5981
redmass: 6.8699 3.1774 2.3481 2.1415 3.8591 5.2216 4.0464 1.9456 5.0045 3.2761 4.3978 3.9352 4.7083 1.6975 3.0967 2.6783 2.5542 2.6757 2.4688 2.1594 2.3255 2.3693 1.5324 2.0956 1.9507 1.9376 1.7361 2.1692 1.8781 1.0842 1.9169 1.1777 1.2350 1.2479 1.3230 1.6236 1.5372 1.5606 1.7573 1.4763 1.4337 1.3426 1.5419 1.4644 1.4176 1.5802 1.0824 1.0851 1.0891 6.3757 10.8606 1.0630 1.0625 1.0608 1.0847 1.0883 1.0997 1.1014 1.0866 1.0983 1.0945 1.0864 1.1022
irintensity: 3.4894 1.2008 0.0981 1.0424 2.4194 2.0307 1.3562 0.3587 1.5213 5.2762 1.4406 0.9016 1.4704 53.4557 2.5963 17.4582 3.7737 6.0278 5.6873 3.2336 2.9963 4.0694 2.1880 4.4851 3.9506 2.6336 0.9561 11.2512 20.8295 0.7189 12.9788 5.7879 2.6888 6.6364 3.9850 0.2851 7.2923 3.4965 1.2752 2.1340 0.2780 0.6090 0.2619 3.8025 0.1609 3.6974 8.6332 8.6544 12.8613 14.8883 231.6389 43.0221 28.1127 37.1781 73.8823 40.1448 15.8525 31.3643 42.9791 22.3817 31.9880 7.3061 28.1494
temp: 298.150 k
press: 1.00000 atm
elementType: 8 6 6 6 6 6 6 6 6 6 6 1 1 1 1 1 1 1 1 1 1 1 1
symmnumber: 1
zpe: 513990.4 jmol-1
zpe.correction: 0.195769 hartree
zpe.thermalcorrener: 0.203686 hartree
zpe.thermalcorrenthalpy: 0.204630 hartree
zpe.thermalcorrgfe: 0.163566 hartree
zpe.sumelectzpe: -462.644094 hartree
zpe.sumelectthermal: -462.636176 hartree
zpe.sumelectthermalent: -462.635232 hartree
zpe.sumelectthermalfe: -462.676296 hartree
dipole: 3.2390 -1.4569 -0.5904
dipole: 3.6002
quadrupole: -74.3550 -62.4956 -62.7682
quadrupole: 3.2062 4.0742 -0.7863
quadrupole: -7.8154 4.0440 3.7714 3.2062 4.0742 -0.7863
hfenergy: -462.8398621 hartree
pointgroup: C01 [X(C10H12O1)]
dipole: -1.2561551 -0.6379694 0.1462414 debye
dipolederiv: -1.0677997 -0.1947713 0.1033471 -0.3388878 -0.4346172 -0.0388151 0.1913995 -0.0610276 -0.36595 0.0699803 0.0276427 -0.060573 0.0112661 0.0764152 -0.0386512 -0.0238495 0.0101069 0.1316146 -0.0545163 -0.1742973 -0.0752672 -0.2086071 -0.1168269 -0.1059212 -0.0689396 -0.1045723 -0.0519586 -0.2615079 0.1336131 0.1436085 0.2597734 -0.1917614 -0.0517462 0.2333469 -0.0585008 0.0130006 0.0900861 -0.0039363 0.0889019 0.022577 0.0390942 0.0127278 0.0200284 -0.0594858 0.0092136 0.1607989 0.030312 0.0616423 0.0374747 -0.0113556 0.0133568 0.054746 0.034737 0.0913762 0.0402531 0.003456 -0.0469562 -0.021796 0.0863034 0.0155905 -0.0551277 -0.0144891 0.0021511 0.103497 0.04471 0.0258831 0.0108145 0.0685799 -0.0074716 0.0350607 0.0365898 0.1545074 1.2253854 0.2304383 -0.2434089 0.3532154 0.5644223 0.2844115 -0.4291973 0.3575098 0.3872578 -0.0700072 -0.0734807 0.1554301 -0.129922 0.1496354 -0.0055963 0.1848903 -0.112214 -0.1486247 -0.1715099 0.0274579 0.1289034 0.0482875 0.1472557 -0.0092231 0.1210107 0.0018412 -0.1224795 0.0420176 -0.0018872 0.0330189 0.0033128 0.0330953 0.0493248 0.0385268 0.0595743 -0.1797035 -0.0503489 0.0817704 0.0906691 0.0577515 0.0168894 -0.0481692 0.0884886 -0.0505354 -0.0161055 0.0103256 -0.0429346 -0.0772828 -0.0384574 0.0362545 -0.0342662 -0.0757298 -0.033558 -0.0721138 0.0035707 -0.1587416 -0.0114861 -0.0702718 -0.1001711 -0.0180303 -0.0113949 -0.053376 0.0575703 -0.0903303 0.1082605 -0.0953374 0.0524307 0.0463359 0.0326169 -0.0924038 0.0606455 -0.0135379 -0.1345793 0.0096675 -0.1236418 0.0077562 0.0396257 0.0012304 -0.1151919 0.0045492 -0.038075 -0.0606494 0.0699735 0.0673868 0.1261758 0.0184761 -0.0640269 0.0811649 -0.0403558 -0.024175 0.0283758 -0.0697447 -0.0080656 -0.1453878 -0.1658655 -0.0001716 -0.0200337 -0.0157189 0.0657584 -0.0007049 -0.073299 -0.056535 -0.0723431 -0.139696 -0.1396825 -0.0361311 -0.0768191 0.0204485 0.0120701 -0.0108564 0.0559073 -0.0074172 0.0184126 0.1334965 0.0376876 0.0741102 -0.0969229 0.0863956 -0.032366 -0.0638877 -0.0117487 -0.1108013 -0.0368268 -0.0526637 -0.0385532 0.111877 0.0891975 0.0690136 -0.0922566 0.0540031 -0.0697003 0.0558431 -0.1056872 0.0795421 0.0848711 unknown
polarizability: 102.4641198|1.0839976|96.1528408|5.0453347|1.6063386|89.2792358 unknown
InChI: InChI=1S/C10H12O/c11-10-8-4-6-1-2-9(10)7(3-6)5-8/h1-2,6-9H,3-5H2
charge 0 multiplicity 1
23 atoms
O  2.56548 0.736412 -0.226493
C  -0.426201 -0.73455 1.282439
C  0.862763 -1.030368 -0.723896
C  0.450964 0.576541 1.113727
C  0.405436 -1.823245 0.531236
C  -1.526892 0.080815 -0.822969
C  -1.785786 -0.613656 0.550386
C  -0.386643 -0.664069 -1.600312
C  1.461324 0.18847 -0.006588
C  -0.281824 1.766603 0.50415
C  -1.177146 1.530672 -0.492844
H  -0.571169 -0.973479 2.349462
H  1.624456 -1.536593 -1.340159
H  0.983588 0.855015 2.038072
H  -0.200649 -2.712814 0.282103
H  1.278632 -2.156465 1.123769
H  -2.438515 0.054821 -1.448695
H  -2.509797 -0.013395 1.129676
H  -2.218204 -1.623795 0.412599
H  -0.79144 -1.61527 -2.003624
H  -0.066667 -0.051176 -2.4636
H  0.008808 2.777455 0.809758
H  -1.687418 2.348873 -1.014699
