program: Gaussian 09
title: 000287203
version: EM64L-G09RevD.01
frameworkgroup: C1[X(C15H22O2)]
method: RPBEPBE
basis: SDD
operation: Freq
keyword: #pfreq=noraman
keyword: PBEPBE/SDD
title: #p freq=noraman PBEPBE/SDD
converged: NO YES NO NO
title: Mulliken charges:
elementType: O O C C C C C C C C C C C C C C C H H H H H H H H H H H H H H H H H H H H H H
charge: -0.267147 -0.243505 0.376994 -0.230543 -0.462418 -0.548171 -0.465832 -0.254063 0.586997 -0.207193 -0.770989 -0.788516 -0.509923 -0.478759 -0.433382 0.192445 -0.505669 0.238008 0.248847 0.231897 0.225560 0.215221 0.219445 0.257598 0.253001 0.212678 0.211178 0.225971 0.234952 0.211960 0.212273 0.220151 0.215704 0.232539 0.212594 0.215988 0.240481 0.241060 0.232569
chargesum: 0.00000
title: Mulliken charges with hydrogens summed into heavy atoms:
elementType: O O C C C C C C C C C C C C C C C
charge: -0.267147 -0.243505 0.376994 0.007465 -0.213571 -0.090715 -0.031166 0.003534 0.586997 0.045808 -0.121162 -0.129330 -0.289772 -0.030516 -0.004800 0.192445 0.208441
polarizability: 1.79438102e+02 -1.43025832e+00 1.64231231e+02 -1.68201300e+00 3.66834202e+00 1.35909321e+02
1716.lowfreq: -13.3478 -8.0380 -0.0006 0.0001 0.0006 6.3008 9.7157 49.0006 80.8414
frequency: -5.6873 48.7549 80.8326 92.0360 103.4113 122.9445 155.4872 176.3554 199.3369 204.6819 220.0832 263.2594 268.6336 278.1797 316.1432 341.4893 359.0917 371.8594 392.8132 399.8995 451.2893 469.1021 513.4135 553.1295 595.9316 630.0548 664.6532 683.4043 707.5499 759.9695 795.1800 805.7294 829.0088 858.2476 862.9981 885.7094 891.4079 911.3178 932.2241 939.9912 953.2239 969.6905 980.7397 993.5082 1015.8040 1020.8427 1038.3382 1050.6423 1079.3791 1091.7889 1105.7372 1110.5620 1116.7404 1123.4622 1140.7290 1147.2000 1157.5094 1174.3698 1191.8310 1203.4173 1216.2004 1226.9047 1234.5298 1253.0252 1261.7332 1273.9177 1291.0405 1298.2907 1307.8462 1318.0888 1326.8441 1337.8918 1349.9457 1358.8457 1377.8673 1394.6397 1419.1657 1451.5618 1458.7015 1459.7432 1462.5084 1463.6247 1470.7660 1476.9474 1479.0078 1495.5526 1504.8586 1635.5723 1687.7595 2947.3142 2957.7973 2966.7984 2971.4944 2982.8842 2988.4427 3003.1418 3003.5443 3019.2421 3021.0709 3026.3330 3035.7447 3041.3564 3049.4248 3055.6277 3056.0771 3076.0686 3086.3596 3090.9011 3101.4770 3104.9543 3148.1826
redmass: 5.1821 3.4732 1.6998 1.6505 3.2933 3.0653 1.0835 3.0333 2.0346 1.5125 2.5388 3.0322 2.4433 4.0151 2.7320 3.4546 3.3587 2.7080 2.6447 2.3038 2.6696 4.0337 2.9143 3.2256 3.7222 3.0899 3.4916 3.8417 5.2816 2.6544 1.8136 2.8217 2.2512 2.4146 1.7078 2.7234 3.0851 2.5168 2.0658 1.5025 1.8311 2.0613 1.8548 1.7943 1.9602 2.1726 1.5676 2.1056 1.6420 1.6336 2.3257 1.3185 2.0027 2.4639 1.5160 1.4658 1.7591 1.4509 1.6979 1.5522 1.8745 2.0198 1.4981 1.4201 1.7134 1.7228 1.4408 1.5228 1.7755 1.3375 1.4460 1.4932 1.5408 1.6946 1.2292 1.2050 1.1928 1.0508 1.0712 1.0616 1.0585 1.0508 1.0886 1.0708 1.0619 1.0629 1.0848 8.8678 7.9154 1.0646 1.0816 1.0369 1.0376 1.0602 1.0694 1.0831 1.0311 1.0835 1.0852 1.0803 1.0979 1.0796 1.0989 1.1024 1.0978 1.0983 1.0961 1.0905 1.1045 1.1044 1.1048
irintensity: 1.9970 0.2214 0.1120 0.3040 0.2491 1.6640 0.2166 3.3439 1.9344 1.7872 3.0050 7.2819 1.1247 1.9013 7.4073 2.3918 2.9850 1.0997 0.8303 0.9309 1.2883 0.3360 0.6818 3.9402 1.3975 3.9494 1.6230 8.3207 4.9889 7.4814 10.6829 1.1483 5.3336 6.6830 5.8877 1.5713 4.8273 10.1046 5.7911 4.5631 3.0845 11.1923 6.8056 5.0294 9.8723 1.4155 0.9494 4.5560 4.1096 3.8915 77.7588 7.8196 14.4115 143.8700 6.8227 16.6541 12.6929 5.3054 3.3389 5.0563 8.0134 4.8535 8.9347 8.6479 8.7070 3.1323 15.4938 2.2280 24.0588 1.0076 13.1729 5.6442 17.1774 3.8715 14.9785 18.3569 22.2395 14.0378 6.8371 6.4698 0.4328 10.7827 10.5237 0.6071 18.2020 6.4601 15.1415 141.0461 4.8696 46.8142 2.9443 28.5385 52.7295 29.6542 14.7528 54.2399 36.6062 36.9871 32.2189 33.8246 18.3720 55.4493 0.0345 39.2642 64.2601 38.6291 36.7555 34.6040 50.3061 25.5620 16.3935
temp: 298.150 k
press: 1.00000 atm
elementType: 8 8 6 6 6 6 6 6 6 6 6 6 6 6 6 6 6 1 1 1 1 1 1 1 1 1 1 1 1 1 1 1 1 1 1 1 1 1 1
symmnumber: 1
zpe: 884212.2 jmol-1
zpe.correction: 0.336779 hartree
zpe.thermalcorrener: 0.352813 hartree
zpe.thermalcorrenthalpy: 0.353757 hartree
zpe.thermalcorrgfe: 0.294415 hartree
zpe.sumelectzpe: -733.894753 hartree
zpe.sumelectthermal: -733.878719 hartree
zpe.sumelectthermalent: -733.877775 hartree
zpe.sumelectthermalfe: -733.937117 hartree
dipole: 0.0935 -0.3436 1.6256
dipole: 1.6641
quadrupole: -96.0716 -97.2776 -108.4452
quadrupole: 2.6403 -6.0925 -0.1510
quadrupole: 4.5265 3.3205 -7.8471 2.6403 -6.0925 -0.1510
hfenergy: -734.2315318 hartree
pointgroup: C01 [X(C15H22O2)]
dipole: -0.0212014 0.0075757 -0.6543253 debye
polarizability: 179.5472959|1.3468984|164.3788|-0.2342803|2.7349911|135.6525581 unknown
InChI: InChI=1S/C15H22O2/c1-15(2)9-7-12-10(13(15)8-9)5-4-6-11(12)14(16)17-3/h5,9,11-13H,4,6-8H2,1-3H3
charge 0 multiplicity 1
39 atoms
O  3.245412 -0.753829 -1.013117
O  2.99689 -0.814838 1.301509
C  -2.611143 -0.44524 -0.673654
C  -1.829491 -1.559617 0.14242
C  -2.35994 0.473425 0.6150
C  -2.327633 -0.857124 1.457727
C  -0.297867 -1.36989 0.01567
C  0.159246 0.013164 0.597671
C  -0.963146 1.059773 0.542763
C  1.456194 0.557657 -0.061498
C  -4.106541 -0.793826 -0.852242
C  -2.050901 0.024903 -2.026411
C  -0.713568 2.388331 0.397847
C  1.798872 1.955748 0.53507
C  0.676596 2.977683 0.237737
C  2.614331 -0.394294 0.183911
C  4.41463 -1.657927 -0.875222
H  -2.128461 -2.607803 -0.038001
H  -3.126793 1.233541 0.844678
H  -1.661375 -0.887355 2.335657
H  -3.332407 -1.187342 1.764668
H  0.002081 -1.461254 -1.046632
H  0.224725 -2.176948 0.564383
H  0.404155 -0.155021 1.667397
H  1.309115 0.651991 -1.153692
H  -4.226412 -1.592286 -1.610015
H  -4.671288 0.090278 -1.205473
H  -4.582213 -1.145006 0.079917
H  -1.000568 0.354868 -1.967475
H  -2.639769 0.880818 -2.409113
H  -2.113806 -0.787347 -2.776612
H  -1.558941 3.091144 0.365936
H  2.760763 2.320734 0.12762
H  1.928531 1.840735 1.627963
H  0.787114 3.373063 -0.795231
H  0.796006 3.854576 0.905747
H  4.107508 -2.61203 -0.41483
H  5.189134 -1.187783 -0.246093
H  4.77426 -1.809972 -1.902476
