program: Gaussian 09
title: 000287202
version: EM64L-G09RevD.01
frameworkgroup: C1[X(C14H20O2)]
method: RPBEPBE
basis: SDD
operation: Freq
keyword: #pfreq=noraman
keyword: PBEPBE/SDD
title: #p freq=noraman PBEPBE/SDD
converged: YES YES NO NO
title: Mulliken charges:
elementType: O O C C C C C C C C C C C C C C H H H H H H H H H H H H H H H H H H H H
charge: -0.416075 -0.237116 0.377389 -0.230218 -0.462484 -0.548899 -0.475023 -0.244307 0.587619 -0.190721 -0.788168 -0.770218 -0.511335 -0.477614 -0.433629 0.131490 0.238968 0.249117 0.232394 0.225832 0.206299 0.233870 0.256221 0.256271 0.232619 0.212937 0.212484 0.211203 0.213032 0.225972 0.221248 0.226817 0.227736 0.214726 0.216839 0.374726
chargesum: 0.00000
title: Mulliken charges with hydrogens summed into heavy atoms:
elementType: O O C C C C C C C C C C C C C C
charge: -0.041349 -0.237116 0.377389 0.008750 -0.213367 -0.090673 -0.034854 0.011914 0.587619 0.065550 -0.130128 -0.120011 -0.290087 -0.023061 -0.002065 0.131490
polarizability: 1.66376818e+02 -4.83264363e+00 1.51693030e+02 -2.71717327e+00 4.21249181e+00 1.25558974e+02
1716.lowfreq: -17.7454 -12.0110 -0.0008 -0.0005 -0.0004 4.6845 18.6305 52.7905 95.2274
frequency: 18.6092 52.5852 95.2014 118.4421 142.8943 163.0665 192.5631 212.4790 229.4544 272.1607 277.0858 301.9882 336.5006 358.8466 376.3715 391.6273 401.6090 448.9131 472.0802 510.9295 553.0149 585.6992 599.9972 611.1382 632.5335 670.4767 706.9180 761.8717 797.9571 808.1932 829.2422 860.7638 863.8646 885.5942 904.1834 928.5161 941.3913 948.0008 956.3744 976.2949 991.1026 1011.1050 1017.6532 1035.0058 1043.5283 1050.6176 1080.0001 1090.8410 1112.6515 1123.7750 1140.3596 1154.9112 1172.0122 1191.4160 1200.9373 1213.1194 1221.5507 1226.0922 1242.5430 1251.9779 1264.0567 1273.3202 1288.8354 1296.9135 1311.7248 1316.2261 1329.8428 1338.8916 1355.1305 1366.2591 1378.3250 1394.3977 1458.9319 1460.2963 1464.6090 1471.5835 1477.0769 1480.8727 1494.5484 1498.5093 1654.6505 1686.6360 2950.0057 2962.3958 2967.5991 2971.6469 2982.6257 2987.7030 3004.7745 3011.7887 3020.9046 3027.6857 3039.5429 3044.6956 3050.4791 3056.8798 3057.7959 3075.7825 3087.0055 3091.4439 3102.4731 3503.3396
redmass: 9.4979 3.9192 3.1177 5.2549 2.7439 1.1999 2.2284 1.1411 3.0010 2.2891 3.7096 2.8381 3.0728 3.4323 2.6161 2.7082 2.3055 2.6137 3.7797 2.9798 3.3313 4.0364 1.4901 2.8737 3.0460 2.5200 3.9909 2.4368 1.8038 2.6333 2.3444 1.6514 2.3175 2.5934 2.4120 2.3288 1.4815 2.4458 1.7470 1.7769 1.5063 1.9278 2.1806 1.5475 2.2550 2.0874 1.5824 1.6550 1.6711 2.3957 1.5156 1.6551 1.5125 1.6385 1.5732 1.6892 1.6873 1.8151 1.3898 1.5732 1.6581 1.7747 1.5563 1.4524 1.8277 1.4097 1.4296 1.5054 1.6170 1.7756 1.2281 1.2010 1.0607 1.0740 1.0598 1.0889 1.0728 1.0619 1.0690 1.0728 8.3282 7.9323 1.0641 1.0814 1.0368 1.0375 1.0616 1.0692 1.0880 1.0820 1.0829 1.0796 1.0844 1.0926 1.0989 1.0978 1.1034 1.0985 1.0959 1.0906 1.1048 1.0638
irintensity: 1.6140 0.2203 0.5409 1.0958 0.7447 0.1787 0.1865 0.4028 0.8664 1.6133 2.5540 0.8156 0.0822 2.4012 0.4284 0.1059 0.7151 0.3932 6.7800 5.7208 20.0455 7.2499 87.4526 28.5903 4.0142 4.3659 44.6032 8.7257 10.6181 3.7904 1.3201 6.2871 3.1576 4.2706 6.1846 3.7906 4.9033 7.2672 3.6866 6.5175 4.6995 27.7295 4.2084 4.4930 201.8838 51.7635 6.6125 5.9158 3.1788 10.1773 0.4567 11.5862 0.6456 3.8407 2.3506 9.3375 1.3233 2.5356 0.6283 6.9389 7.3371 2.1895 6.1745 0.9100 20.8127 3.3772 8.1671 4.7935 8.0281 18.1833 16.4842 17.6567 4.4477 7.3468 0.9258 10.8038 0.6499 16.5632 14.1786 8.0312 188.6242 3.6420 47.2222 1.3925 28.0669 51.3288 30.2963 11.3284 36.2575 22.5143 62.1806 35.5258 20.2207 50.4083 0.1525 62.4541 38.0559 39.4826 37.9559 32.6598 48.8353 19.5839
temp: 298.150 k
press: 1.00000 atm
elementType: 8 8 6 6 6 6 6 6 6 6 6 6 6 6 6 6 1 1 1 1 1 1 1 1 1 1 1 1 1 1 1 1 1 1 1 1
symmnumber: 1
zpe: 812412.9 jmol-1
zpe.correction: 0.309432 hartree
zpe.thermalcorrener: 0.324544 hartree
zpe.thermalcorrenthalpy: 0.325488 hartree
zpe.thermalcorrgfe: 0.267257 hartree
zpe.sumelectzpe: -694.682572 hartree
zpe.sumelectthermal: -694.667460 hartree
zpe.sumelectthermalent: -694.666516 hartree
zpe.sumelectthermalfe: -694.724747 hartree
dipole: 0.3236 0.8132 1.1856
dipole: 1.4737
quadrupole: -91.2598 -94.6613 -100.9237
quadrupole: -1.3474 -3.9931 -3.3110
quadrupole: 4.3551 0.9536 -5.3088 -1.3474 -3.9931 -3.3110
hfenergy: -694.9920039 hartree
pointgroup: C01 [X(C14H20O2)]
dipole: -0.1326556 0.3018775 -0.4768941 debye
polarizability: 166.3077043|4.6641886|151.3314956|-3.3556642|-5.2513228|125.9896219 unknown
InChI: InChI=1S/C14H20O2/c1-14(2)8-6-11-9(12(14)7-8)4-3-5-10(11)13(15)16/h4,8,10-12,15H,3,5-7H2,1-2H3
charge 0 multiplicity 1
36 atoms
O  3.563808 -1.174301 -1.267092
O  2.951353 -1.650703 0.91862
C  -2.496478 -0.299554 -0.504586
C  -1.808219 -1.461238 0.329364
C  -1.974661 0.659005 0.669215
C  -2.053587 -0.595353 1.618709
C  -0.287571 -1.525948 0.044448
C  0.430079 -0.194556 0.46145
C  -0.521779 1.009727 0.413538
C  1.717963 0.088845 -0.348334
C  -2.019586 -0.020008 -1.939851
C  -4.037642 -0.420416 -0.510619
C  -0.094187 2.267434 0.122616
C  2.326599 1.463223 0.080116
C  1.342815 2.617878 -0.220049
C  2.756986 -0.994053 -0.12957
H  -2.277774 -2.459484 0.271307
H  -2.589898 1.545557 0.901456
H  -1.311794 -0.667929 2.43087
H  -3.059135 -0.738947 2.043838
H  -0.121588 -1.735413 -1.031039
H  0.165954 -2.36307 0.607227
H  0.747344 -0.326927 1.516654
H  1.489106 0.131418 -1.43058
H  -0.93126 0.14128 -2.009601
H  -2.286266 -0.861019 -2.609058
H  -2.508231 0.89136 -2.335373
H  -4.499459 0.518755 -0.870899
H  -4.355518 -1.233022 -1.192242
H  -4.456746 -0.639571 0.486765
H  -0.824359 3.089588 0.103713
H  3.286357 1.633687 -0.44177
H  2.538798 1.424821 1.165963
H  1.40548 2.899946 -1.293143
H  1.658746 3.518695 0.34396
H  4.260749 -1.857107 -1.065021
