program: Gaussian 09
title: 000287181
version: EM64L-G09RevD.01
frameworkgroup: C1[X(C9H5BrO2)]
method: RPBEPBE
basis: SDD
operation: Freq
keyword: #p
keyword: freq=noraman
keyword: PBEPBE/SDD
title: #p freq=noraman PBEPBE/SDD
converged: NO NO NO NO
title: Mulliken charges:
elementType: Br O O C C C C C C C C C H H H H H
charge: 0.027624 -0.243088 -0.184393 0.375887 0.171593 -0.310883 -0.236648 -0.327637 -0.248954 -0.152834 -0.294537 0.120914 0.260252 0.250236 0.274401 0.260120 0.257948
chargesum: 0.00000
title: Mulliken charges with hydrogens summed into heavy atoms:
elementType: Br O O C C C C C C C C C
charge: 0.027624 -0.243088 -0.184393 0.375887 0.171593 -0.050631 0.013587 -0.053236 -0.248954 0.107286 -0.036589 0.120914
polarizability: 2.20489063e+02 6.01157673e+00 1.08873903e+02 -5.55343480e-03 -2.78298626e-03 4.24201961e+01
1716.lowfreq: -1.9209 -1.3037 -0.0008 -0.0007 -0.0005 14.2732 60.8091 147.0845 154.1140
frequency: 60.8088 147.0786 154.1133 160.3180 238.6553 322.3082 336.3656 373.5877 451.7822 460.8783 479.2050 519.2185 553.3221 612.7037 669.6571 706.3447 744.5947 773.8117 804.2584 827.8450 829.9371 889.2142 894.2255 961.4548 991.8186 1033.6266 1066.7054 1119.7760 1171.1674 1231.5534 1238.0264 1263.3387 1358.0706 1394.0369 1416.6929 1464.5590 1546.2430 1596.2047 1617.5996 1696.1044 3139.2317 3158.6189 3166.0929 3184.8067 3186.8693
redmass: 11.3454 7.9422 9.5469 4.7024 21.1061 6.8222 6.3006 3.7211 3.0513 6.9636 8.0025 6.8996 3.2919 8.4188 3.9861 8.0367 4.0873 7.6630 5.9225 1.4640 1.4760 7.0321 1.5094 1.3413 1.3188 3.0545 2.3690 1.8153 1.3925 1.8266 2.0586 1.4857 2.1651 10.3629 2.5191 3.2485 7.1208 7.6230 7.1641 11.0493 1.0907 1.0929 1.0889 1.0978 1.0959
irintensity: 3.1893 1.3148 1.1539 5.5312 0.7956 0.8743 2.2102 0.4508 7.8808 2.4826 6.0974 12.4513 6.4208 7.6867 0.4750 46.9192 7.1473 5.5744 94.2467 45.3327 38.5735 8.6010 35.0846 1.6491 0.3012 67.2323 11.3912 31.5234 27.6742 31.8181 56.9900 2.0213 8.4229 0.1398 57.1537 27.0859 70.8130 18.7014 15.6308 573.6095 7.7550 1.4506 0.3512 1.0459 1.6702
temp: 298.150 k
press: 1.00000 atm
elementType: 35 8 8 6 6 6 6 6 6 6 6 6 1 1 1 1 1
symmnumber: 1
zpe: 299143.2 jmol-1
zpe.correction: 0.113938 hartree
zpe.thermalcorrener: 0.123423 hartree
zpe.thermalcorrenthalpy: 0.124368 hartree
zpe.thermalcorrgfe: 0.077719 hartree
zpe.sumelectzpe: -509.038512 hartree
zpe.sumelectthermal: -509.029027 hartree
zpe.sumelectthermalent: -509.028082 hartree
zpe.sumelectthermalfe: -509.074731 hartree
dipole: 2.8472 -2.1548 -0.0005
dipole: 3.5706
quadrupole: -102.7182 -66.5785 -80.3401
quadrupole: 11.2155 0.0029 -0.0016
quadrupole: -19.5060 16.6338 2.8722 11.2155 0.0029 -0.0016
hfenergy: -509.1524501 hartree
pointgroup: C01 [X(C9H5Br1O2)]
dipole: 1.0571436 -0.9251486 -0.0001935 debye
dipolederiv: -0.7137839 0.1110939 0.0000049 0.190693 -0.077834 0.0000002 -0.0000048 0.0000024 -0.0210165 -1.4337378 0.0686999 0.0001092 -0.3888038 -0.3526959 0.0000936 -0.0000691 -0.0000176 -0.1995045 -1.5233017 0.1559485 -0.0001138 0.5097606 -0.4666578 0.0000543 0.0005272 -0.0000672 -0.3291241 -0.333776 -0.0545876 -0.0000103 -0.2627347 -0.2244819 0.0000087 0.0000517 0.0000241 0.019633 0.7868671 -0.1832607 -0.0000095 -0.0685404 0.1122282 -0.0000064 -0.000003 -0.0000254 0.1284152 -0.0996362 0.1074829 0.0000028 0.0706101 0.0729478 -0.0000042 0.0000005 -0.0000171 -0.0859605 0.6433065 0.0629442 0.0000316 0.2867864 0.2860514 -0.0000497 -0.0000955 -0.0000195 -0.0716984 -0.1634886 0.0391859 0.0000078 0.007171 0.0847424 -0.0000061 -0.0000385 0.0000172 -0.1548031 1.2427817 -0.2946637 -0.0000057 -0.5928949 -0.0874349 0.0000008 0.0000118 0.0000051 -0.1401885 -0.3841588 0.0611885 -0.000005 0.1676204 0.0980648 0.0000008 0.0000056 -0.0000028 -0.079258 -0.558495 0.0894825 -0.0000494 0.5334995 -0.1799743 -0.0000486 -0.0000536 0.0000323 -0.1704139 2.2562104 -0.1523853 0.0000145 -0.4163749 0.7403763 -0.0001188 -0.0003189 -0.0000151 0.2838894 0.0914999 0.0065849 0.000001 0.0419438 -0.0281729 0.0000072 0. 0.0000127 0.1596744 0.0823766 0.0721989 -0.0000005 -0.0016091 -0.059143 0.0000342 -0.0000292 0.0000107 0.142402 0.0617774 0.0490427 0.0000005 0.0207228 0.0027662 0.0000057 -0.0000024 0.0000098 0.1780556 0.0256143 -0.0755532 0.0000043 -0.0628313 0.0451978 0.0000028 0.0000062 -0.000006 0.1602093 0.0199442 -0.0634024 0.0000177 -0.0350187 0.0340198 0.0000256 0.000012 0.0000562 0.1796886 unknown
polarizability: 220.7778978|-1.9537904|108.5850683|-0.005737|-0.0023817|42.4201961 unknown
InChI: InChI=1S/C9H5BrO2/c10-7-2-3-8-6(5-7)1-4-9(11)12-8/h1-5H
charge 0 multiplicity 1
17 atoms
Br 4.383782 -0.56677 0.000002
O  -1.545279 1.083474 -0.000033
O  -3.804159 0.591856 0.000387
C  0.135049 -0.715345 0.000028
C  -0.214147 0.6685 0.000002
C  1.511836 -1.078217 0.000035
C  -0.94102 -1.685854 0.000141
C  0.778709 1.672261 -0.000023
C  2.487772 -0.073119 -0.000005
C  2.136064 1.301582 -0.000034
C  -2.258416 -1.287836 0.000147
C  -2.654803 0.121041 -0.000197
H  1.793146 -2.136013 0.000078
H  -0.691586 -2.753277 0.000299
H  0.477848 2.723389 -0.000046
H  2.915199 2.068688 -0.000058
H  -3.081295 -2.007158 0.000374
