program: Gaussian 09
title: 000287199
version: EM64L-G09RevD.01
frameworkgroup: C1[X(C15H23BrO)]
method: RPBEPBE
basis: SDD
operation: Freq
keyword: #p
keyword: freq=noraman
keyword: PBEPBE/SDD
title: #p freq=noraman PBEPBE/SDD
converged: NO YES NO NO
title: Mulliken charges:
elementType: Br O C C C C C C C C C C C C C C C H H H H H H H H H H H H H H H H H H H H H H H
charge: -0.049704 -0.203371 0.472799 -0.218414 -0.153673 0.514681 -0.668814 -0.768000 -0.510242 -0.516061 -0.206669 -0.408923 -0.438375 -0.791977 -0.788882 0.180901 -0.789524 0.239927 0.293729 0.236395 0.243248 0.312409 0.235464 0.205411 0.224242 0.201279 0.218363 0.208848 0.198924 0.199520 0.228844 0.220427 0.229912 0.221117 0.248486 0.233718 0.213036 0.240849 0.233650 0.256450
chargesum: 0.00000
title: Mulliken charges with hydrogens summed into heavy atoms:
elementType: Br O C C C C C C C C C C C C C C C
charge: -0.049704 -0.203371 0.472799 0.021513 0.140056 0.514681 -0.189172 -0.455591 -0.069367 -0.090541 0.011694 -0.001151 -0.010011 -0.120520 -0.093642 0.180901 -0.058574
polarizability: 1.83234053e+02 1.26510135e+00 1.64587232e+02 3.86752026e+00 4.81404407e+00 1.59581141e+02
1716.lowfreq: -15.5539 -10.9887 -0.0006 -0.0005 -0.0003 8.7173 39.4499 46.9722 61.9818
frequency: 39.2435 46.8850 61.7860 89.6450 108.0779 125.6486 163.8771 188.3227 201.4626 216.1928 228.7016 239.8330 262.8375 278.5172 310.2173 318.4864 343.2670 374.1752 401.5417 425.1555 441.7109 455.4044 476.7657 499.6236 569.3231 571.0580 579.1813 605.8818 657.2169 714.2538 777.2593 792.5534 812.6483 839.0094 850.5848 869.6144 890.8346 912.5624 917.5885 927.4358 937.4863 944.8697 959.3904 967.1607 976.0462 987.6496 997.7161 1018.7229 1028.0867 1062.5552 1064.3393 1092.0891 1101.9997 1110.5405 1134.6488 1138.5735 1163.4585 1171.1579 1178.9669 1189.6154 1205.4746 1217.8219 1225.4522 1237.8415 1242.1619 1262.1337 1274.2076 1280.0548 1286.6597 1295.8877 1304.4496 1318.3822 1321.9039 1343.8267 1349.4231 1355.6104 1366.4145 1379.6419 1398.7944 1442.8735 1452.7111 1459.6582 1460.9641 1463.5979 1469.9219 1473.6179 1474.6154 1479.4347 1487.0204 1501.4865 1628.0201 2951.6658 2965.2696 2971.6222 2972.6527 2978.5235 2980.3861 2982.9082 2984.6601 3009.1834 3019.5486 3027.7480 3033.7729 3037.0688 3045.2421 3048.9015 3065.0034 3065.2244 3068.7026 3074.6457 3074.8865 3081.2011 3102.3454 3118.7712
redmass: 5.1370 6.2642 3.2293 3.2759 1.3471 2.5859 3.6293 3.3460 3.4061 1.3950 2.3848 1.2292 3.6750 2.2139 2.5661 2.2287 2.7227 2.4687 2.8262 2.4581 2.3326 2.5341 2.3417 2.4185 3.4707 3.6510 2.8762 2.8222 3.6715 3.8953 3.1465 3.8627 2.6865 2.1557 2.3470 1.7459 2.4315 2.2129 2.2118 1.9698 2.3442 1.5730 1.6745 1.9127 1.6630 1.7099 1.3783 2.0087 1.8748 1.5933 1.5717 1.5806 2.5757 1.8952 1.8264 1.9257 1.5524 1.9856 1.6755 1.6715 1.9590 1.8132 1.7642 1.3803 1.5404 1.7443 1.5504 1.4397 1.3899 1.5912 1.7148 1.4247 1.4420 1.4362 1.5589 1.4972 1.2464 1.1934 1.1995 1.0672 1.0599 1.0562 1.0816 1.0564 1.0858 1.0853 1.0729 1.0613 1.0704 1.0706 8.0075 1.0818 1.0592 1.0354 1.0634 1.0384 1.0609 1.0427 1.0656 1.0595 1.0987 1.0847 1.0995 1.0875 1.1030 1.0894 1.0939 1.0990 1.1021 1.0978 1.1001 1.0949 1.0976 1.1007
irintensity: 4.6484 0.1404 0.2753 0.9597 1.1026 1.2192 0.3601 2.7553 2.8234 0.5089 0.8358 0.0781 0.3491 0.5289 2.5464 0.1400 1.2098 0.6620 0.3695 0.3293 1.8631 1.3937 0.3371 0.6320 5.3489 6.2791 1.5496 5.5624 4.2384 30.1102 4.7604 0.7648 4.6307 0.9083 8.1283 8.4814 6.7471 10.2623 11.2182 1.3072 7.9990 7.5761 1.5079 5.6300 7.0766 5.4225 0.2850 0.1781 3.3513 0.2375 1.9064 8.0632 3.9846 6.1998 3.6534 3.7127 14.2460 57.4641 10.7525 4.1107 6.0615 1.1386 5.7918 3.7363 8.7819 8.2797 56.5845 1.1555 0.7902 3.2869 2.0915 3.6979 5.3757 0.9235 2.0086 8.7889 67.6073 17.1198 17.2157 17.8873 13.2378 2.4551 11.8379 4.0803 8.1759 16.8698 0.8599 17.0373 28.5335 2.6423 93.0461 11.7720 24.5767 29.8726 36.0830 3.2125 34.8964 30.0202 43.1436 30.1656 29.2772 5.0423 48.5546 11.3190 42.8751 52.6548 14.6593 17.2724 31.1869 50.9047 33.7168 29.1581 24.7274 15.3472
temp: 298.150 k
press: 1.00000 atm
elementType: 35 8 6 6 6 6 6 6 6 6 6 6 6 6 6 6 6 1 1 1 1 1 1 1 1 1 1 1 1 1 1 1 1 1 1 1 1 1 1 1
symmnumber: 1
zpe: 908739.9 jmol-1
zpe.correction: 0.346121 hartree
zpe.thermalcorrener: 0.363405 hartree
zpe.thermalcorrenthalpy: 0.364350 hartree
zpe.thermalcorrgfe: 0.301139 hartree
zpe.sumelectzpe: -672.753494 hartree
zpe.sumelectthermal: -672.736210 hartree
zpe.sumelectthermalent: -672.735266 hartree
zpe.sumelectthermalfe: -672.798476 hartree
dipole: 1.4344 2.8525 4.0139
dipole: 5.1289
quadrupole: -107.0953 -112.8589 -119.6789
quadrupole: -1.4017 5.1053 -3.0451
quadrupole: 6.1157 0.3522 -6.4679 -1.4017 5.1053 -3.0451
hfenergy: -673.0996151 hartree
pointgroup: C01 [X(C15H23Br1O1)]
dipole: -0.1531268 0.4747905 1.9552145 debye
polarizability: 181.0519772|-0.4528173|156.6691052|-6.581228|-1.6525049|169.681344 unknown
InChI: InChI=1S/C15H23BrO/c1-9(17)11-5-4-6-15-8-10(7-12(11)15)14(2,3)13(15)16/h10-13H,4-8H2,1-3H3
charge 0 multiplicity 1
40 atoms
Br 1.700431 0.687084 -2.599276
O  -2.640037 -1.731771 -1.269057
C  0.53775 0.885355 0.196249
C  1.550601 -0.912718 1.225273
C  -0.427296 -0.315959 -0.113641
C  2.581783 -0.593562 0.076659
C  1.044442 0.502811 1.631776
C  1.891545 0.686162 -0.554276
C  0.245513 -1.522523 0.640325
C  -0.05628 2.290258 -0.012967
C  -1.88101 -0.070086 0.364895
C  -1.496932 2.436714 0.522666
C  -2.407018 1.335366 -0.062569
C  3.958861 -0.186737 0.669601
C  2.812386 -1.783583 -0.881235
C  -2.840263 -1.148096 -0.170189
C  -4.060842 -1.467191 0.687228
H  2.000389 -1.518728 2.030582
H  -0.468799 -0.502794 -1.20184
H  0.227227 0.469873 2.374275
H  1.831248 1.178355 2.011871
H  2.525012 1.580795 -0.420777
H  0.416187 -2.392149 -0.013538
H  -0.399002 -1.8680 1.472961
H  -0.064374 2.507201 -1.10019
H  0.607958 3.044649 0.455348
H  -1.925458 -0.102692 1.475032
H  -1.890795 3.435265 0.252312
H  -1.509807 2.375941 1.630166
H  -3.450653 1.475956 0.280177
H  -2.411875 1.400811 -1.168683
H  4.459134 -1.063919 1.12101
H  4.619495 0.206335 -0.125875
H  3.869744 0.590296 1.450507
H  1.917707 -2.037852 -1.471154
H  3.619292 -1.553464 -1.599168
H  3.112773 -2.675995 -0.299656
H  -3.752209 -2.132551 1.518113
H  -4.487858 -0.556372 1.144336
H  -4.826768 -1.987281 0.090732
