program: Gaussian 09
title: 000287198
version: EM64L-G09RevD.01
frameworkgroup: C1[X(C16H24O3)]
method: RPBEPBE
basis: SDD
operation: Freq
keyword: #pfreq=noraman
keyword: PBEPBE/SDD
title: #p freq=noraman PBEPBE/SDD
converged: YES YES NO NO
title: Mulliken charges:
elementType: O O O C C C C C C C C C C C C C C C C H H H H H H H H H H H H H H H H H H H H H H H H
charge: -0.234509 -0.207828 -0.233003 0.404810 -0.208641 -0.195416 0.428475 -0.662796 -0.276911 -0.520435 -0.544222 -0.212913 -0.409780 -0.440765 -0.769890 -0.793348 0.182526 -0.789479 -0.004897 0.239683 0.278221 0.230186 0.248045 0.275009 0.235353 0.207151 0.204424 0.230620 0.224434 0.208606 0.201320 0.200626 0.222362 0.212410 0.226209 0.231164 0.226010 0.242306 0.208834 0.241792 0.234595 0.256246 0.203415
chargesum: 0.00000
title: Mulliken charges with hydrogens summed into heavy atoms:
elementType: O O O C C C C C C C C C C C C C C C C
charge: -0.234509 -0.207828 -0.233003 0.404810 0.031042 0.082805 0.428475 -0.184565 -0.001902 -0.077930 -0.109178 0.011521 0.000146 -0.017777 -0.100107 -0.116197 0.182526 -0.056846 0.198518
polarizability: 1.96977319e+02 -3.41924137e+00 1.63344469e+02 -6.56124759e+00 -4.50085830e+00 1.48523121e+02
1716.lowfreq: -12.7738 -9.1182 -0.0005 -0.0003 0.0005 11.8381 38.1064 40.7153 51.1045
frequency: 38.0961 40.6614 51.0150 62.4636 99.8171 121.0224 123.9280 169.1578 182.6642 196.8440 215.8259 216.3001 249.5542 265.7607 273.2348 291.9549 310.3353 330.8433 348.5095 365.8612 382.1820 406.2400 432.4513 460.2312 471.9778 494.5523 519.0438 569.2993 577.8657 586.6801 631.0669 688.1843 725.0698 788.5139 798.1212 810.7956 829.6985 861.6841 866.2714 877.0285 892.5943 924.3973 926.7073 939.5377 947.3782 948.2773 954.1747 962.7580 965.6689 978.7638 989.9774 1003.0131 1025.6973 1034.9616 1062.6990 1069.1628 1084.5866 1096.3802 1102.8247 1117.4444 1139.8995 1156.4449 1164.1548 1174.7330 1182.8891 1199.3230 1210.4815 1222.9236 1238.4385 1244.2407 1254.4435 1268.8459 1272.5133 1284.7289 1293.0547 1311.8422 1316.8523 1320.5771 1333.0780 1342.0898 1344.0216 1350.5126 1353.7970 1366.6360 1378.6687 1401.7109 1442.3658 1452.7970 1460.0131 1461.5519 1466.8957 1467.5082 1470.4704 1477.6734 1485.4179 1488.6534 1510.4997 1611.8999 1627.8579 2959.3691 2964.9772 2973.3244 2977.5199 2977.8192 2978.7511 2984.0597 2989.0003 3000.1797 3010.8141 3023.6151 3031.2593 3031.7107 3039.4806 3048.7812 3049.8716 3063.8478 3070.2894 3075.0688 3076.2993 3080.3220 3084.3795 3093.7563 3118.4633
redmass: 5.2997 8.5369 4.7045 3.2525 3.0426 1.5135 1.7980 3.9357 3.0815 1.7101 1.9113 2.9280 1.5045 2.9855 2.1085 2.7134 2.2880 2.1338 3.1329 2.8203 3.0139 2.7522 2.9378 2.6948 2.1311 2.3136 3.0121 3.9923 2.6417 2.9076 3.4348 3.6202 5.2973 2.7188 4.2938 2.6665 2.4972 2.0132 2.1087 3.1351 2.4191 1.9925 2.3985 1.9443 2.1402 1.6358 1.6141 1.7620 1.9943 2.0678 1.5873 1.3661 1.8136 2.1223 1.4613 1.7573 1.4583 5.7183 2.8694 1.7281 1.7260 1.5621 2.2174 2.0684 2.1612 2.0453 2.0589 1.5491 2.1209 1.3538 1.8901 1.5957 1.5462 1.3734 1.6126 1.7324 1.4622 1.3678 1.1741 1.4086 1.3322 1.3860 1.4256 1.2467 1.1962 1.1981 1.0681 1.0605 1.0837 1.0519 1.0670 1.0804 1.0909 1.0705 1.0707 1.0629 1.0700 8.8240 7.9824 1.0809 1.0676 1.0593 1.0621 1.0384 1.0362 1.0362 1.0706 1.0829 1.0614 1.0907 1.0873 1.0982 1.0996 1.0979 1.0899 1.0943 1.0992 1.0987 1.1002 1.1011 1.0956 1.0988 1.1006
irintensity: 2.5194 2.4062 2.2712 0.5023 1.2396 0.9719 0.7836 5.2215 2.3716 3.1258 4.4702 2.4534 0.2677 2.9603 0.3468 0.3841 1.7292 1.2169 8.0245 7.6396 0.3175 0.5370 1.0938 4.8429 0.8112 0.0739 3.4666 13.5815 0.2850 1.1128 1.1912 0.8680 2.0752 2.4858 5.1523 2.3321 4.0012 7.5111 1.5868 5.5409 14.4397 2.6344 3.8090 5.1734 25.4415 12.9021 2.9132 2.2971 3.8324 8.3548 7.3999 1.8530 2.2003 2.8567 10.7818 3.9601 4.6322 318.6240 26.1364 2.7910 1.7443 5.6827 27.7540 28.6093 13.1360 6.6218 3.0603 4.7235 0.4153 2.3984 4.0088 7.7472 54.7069 2.8587 3.5008 4.2805 2.1531 1.7080 12.8978 1.6044 2.0844 2.5185 2.8153 68.4174 18.8915 21.2376 18.2654 11.6740 13.0811 2.7330 1.6898 11.3369 10.1318 9.0979 30.8989 18.2148 3.0125 242.0574 116.6602 7.1318 21.7904 31.1868 37.1926 3.0328 21.4886 32.3561 34.5325 19.4285 31.0582 61.4650 17.3648 44.9947 46.7917 26.6587 52.7683 14.6525 5.1994 44.2370 21.9170 68.4063 19.9039 24.5731 15.6468
temp: 298.150 k
press: 1.00000 atm
elementType: 8 8 8 6 6 6 6 6 6 6 6 6 6 6 6 6 6 6 6 1 1 1 1 1 1 1 1 1 1 1 1 1 1 1 1 1 1 1 1 1 1 1 1
symmnumber: 1
zpe: 969042.6 jmol-1
zpe.correction: 0.369089 hartree
zpe.thermalcorrener: 0.387949 hartree
zpe.thermalcorrenthalpy: 0.388893 hartree
zpe.thermalcorrgfe: 0.322492 hartree
zpe.sumelectzpe: -848.293618 hartree
zpe.sumelectthermal: -848.274758 hartree
zpe.sumelectthermalent: -848.273814 hartree
zpe.sumelectthermalfe: -848.340214 hartree
dipole: 1.9121 1.2222 -4.3648
dipole: 4.9195
quadrupole: -114.2119 -111.2723 -125.7180
quadrupole: 2.2276 -1.0210 4.0950
quadrupole: 2.8555 5.7951 -8.6506 2.2276 -1.0210 4.0950
hfenergy: -848.6627066 hartree
pointgroup: C01[X(C16H24O3)]
dipole: 0.7392582 0.5454219 -1.7035505 debye
polarizability: 196.3104017|-4.563062|164.1480285|-7.9820249|-3.2117239|148.3864782 unknown
InChI: InChI=1S/C16H24O3/c1-10(18)12-5-4-6-16-8-11(7-13(12)16)15(2,3)14(16)19-9-17/h9,11-14H,4-8H2,1-3H3
charge 0 multiplicity 1
43 atoms
O  -2.4988 1.308163 0.089716
O  3.149346 -1.328155 1.672609
O  -3.69107 0.742406 2.031371
C  -0.174359 0.622896 -0.392105
C  -0.754478 -1.37593 -1.36299
C  0.925401 -0.384988 0.12466
C  -1.937376 -1.15998 -0.340376
C  -0.446252 0.078101 -1.829977
C  -1.496677 0.208349 0.324229
C  0.559802 -1.725705 -0.613632
C  0.172153 2.111593 -0.200557
C  2.375049 0.064433 -0.188069
C  1.627017 2.458424 -0.583848
C  2.623196 1.560553 0.180401
C  -3.27999 -1.06548 -1.110047
C  -2.073173 -2.266966 0.733448
C  3.403859 -0.807993 0.552918
C  4.757899 -0.99648 -0.122058
C  -3.507426 1.453589 1.0216
H  -1.018867 -2.09574 -2.156476
H  0.857437 -0.507903 1.22311
H  0.433019 0.135585 -2.496571
H  -1.294384 0.584077 -2.322166
H  -1.381831 0.11522 1.419894
H  0.465331 -2.582756 0.072175
H  1.344907 -1.985822 -1.350366
H  0.022406 2.376869 0.867214
H  -0.53946 2.73145 -0.774836
H  2.569368 -0.030669 -1.277547
H  1.824846 3.523041 -0.353545
H  1.779035 2.333021 -1.675332
H  3.665839 1.846563 -0.059759
H  2.489439 1.696022 1.272342
H  -3.489731 -2.039491 -1.590376
H  -4.119598 -0.845599 -0.426627
H  -3.267187 -0.28918 -1.893204
H  -1.183484 -2.336492 1.383437
H  -2.93877 -2.05019 1.385027
H  -2.229724 -3.256639 0.264274
H  4.656797 -1.752863 -0.925803
H  5.107474 -0.063315 -0.599454
H  5.505215 -1.354965 0.603119
H  -4.133702 2.318044 0.726274
