program: Gaussian 09
title: 000287183
version: EM64L-G09RevD.01
frameworkgroup: C1[X(C11H5Cl4NOS)]
method: RPBEPBE
basis: SDD
operation: Freq
keyword: #p
keyword: freq=noraman
keyword: PBEPBE/SDD
title: #p freq=noraman PBEPBE/SDD
converged: YES YES NO NO
title: Mulliken charges:
elementType: Cl Cl Cl Cl S O N C C C C C C C C C C C H H H H H
charge: 0.064743 0.017254 0.055896 0.052713 0.703174 -0.553960 0.178936 0.225102 -0.132128 -0.071220 -0.080668 -0.220525 -0.256519 -0.312331 -0.308899 -0.206866 -0.209502 -0.220331 0.250246 0.304222 0.240150 0.242222 0.238291
chargesum: 0.00000
title: Mulliken charges with hydrogens summed into heavy atoms:
elementType: Cl Cl Cl Cl S O N C C C C C C C C C C C
charge: 0.064743 0.017254 0.055896 0.052713 0.703174 -0.553960 0.178936 0.225102 -0.132128 -0.071220 -0.080668 0.029720 0.047703 -0.312331 -0.308899 0.033284 0.032720 0.017961
polarizability: 2.31454646e+02 2.25810741e+01 2.12446972e+02 4.29091725e+00 9.27627066e+00 1.34905503e+02
1716.lowfreq: -18.4276 -4.4949 -0.0024 -0.0017 -0.0010 4.0144 21.0177 28.2835 45.2671
frequency: 18.3463 28.2218 45.2082 54.4915 72.5271 134.9425 137.3308 159.2952 161.6174 186.5759 190.6094 203.9331 218.7830 267.5883 308.8221 317.2530 324.6781 340.3138 353.9980 401.1868 411.3641 460.6306 480.8576 539.0992 560.7338 602.8658 603.0209 607.0997 646.7510 685.6182 698.2954 734.3782 758.2558 806.8479 839.7044 854.2558 936.3614 974.0224 983.1586 988.4298 1007.7638 1008.9157 1039.8904 1075.7716 1147.7642 1171.9068 1178.6475 1256.2912 1268.7220 1302.0343 1338.0135 1382.2640 1431.6597 1452.7950 1466.2070 1521.8474 1577.8500 1600.3670 3130.9251 3135.4309 3143.8804 3156.5185 3170.8617
redmass: 9.1616 9.6609 4.4854 20.3069 12.6958 12.7280 13.9163 8.5273 7.9853 17.4523 12.4112 27.1588 17.8846 10.8543 29.5466 11.0095 26.1445 14.6026 12.5102 3.2917 7.4680 16.5417 3.9661 13.4069 11.0123 7.0410 11.0072 14.0400 7.0510 12.6235 2.3451 10.1867 1.4836 12.7504 17.4681 1.2453 1.3574 7.1687 9.0994 1.3824 2.9034 1.5725 2.0641 1.5726 11.7021 1.0723 1.1154 12.0407 12.0293 1.3096 12.5258 8.7223 2.1917 2.0144 11.8984 12.4861 5.7698 6.7446 1.0867 1.0879 1.0918 1.0963 1.1014
irintensity: 0.5245 0.5607 0.0207 0.0471 0.0483 1.9400 0.0587 1.2579 4.2938 1.7430 2.8565 0.0564 0.3309 0.0526 0.2014 1.5203 1.1647 34.1763 0.1196 3.5044 15.5273 2.7122 20.1912 12.1310 13.4228 3.0353 15.8848 67.1067 0.7167 5.0539 33.2132 3.2915 65.7639 9.1743 42.7149 0.6901 5.2391 17.7357 71.4780 0.0711 3.0535 2.0647 14.8356 10.2405 86.4134 1.1414 4.3229 93.3002 285.6815 2.4470 92.1503 3.3854 14.6715 22.1476 26.2402 36.2775 6.3638 1.8152 3.9360 2.9151 0.2879 13.0572 29.5796
temp: 298.150 k
press: 1.00000 atm
elementType: 17 17 17 17 16 8 7 6 6 6 6 6 6 6 6 6 6 6 1 1 1 1 1
symmnumber: 1
zpe: 341317.3 jmol-1
zpe.correction: 0.130001 hartree
zpe.thermalcorrener: 0.147454 hartree
zpe.thermalcorrenthalpy: 0.148399 hartree
zpe.thermalcorrgfe: 0.081508 hartree
zpe.sumelectzpe: -2789.061086 hartree
zpe.sumelectthermal: -2789.043632 hartree
zpe.sumelectthermalent: -2789.042688 hartree
zpe.sumelectthermalfe: -2789.109579 hartree
dipole: 3.1574 -1.9300 -2.8301
dipole: 4.6587
quadrupole: -134.7696 -136.1631 -142.2798
quadrupole: 1.0334 -13.5587 0.4279
quadrupole: 2.9679 1.5744 -4.5423 1.0334 -13.5587 0.4279
hfenergy: -2789.1910864 hartree
pointgroup: C01 [X(C11H5Cl4N1O1S1)]
dipole: -1.2811004 -0.3998258 1.2483657 debye
dipolederiv: -0.2529712 0.3145269 -0.1845983 0.2009017 -0.2717088 0.1702247 -0.1524579 0.1939326 -0.0857009 -0.0786802 -0.1274268 0.014067 0.0520204 -0.7266772 0.1542212 -0.0290551 0.1115889 -0.0467054 -0.1189522 -0.189432 0.015584 -0.2924815 -0.8824003 0.1004366 0.0089941 0.0759848 -0.0397974 -0.5833828 0.311544 -0.3061275 0.3296401 -0.2525108 0.1955943 -0.3869428 0.2255907 -0.243497 0.9061803 0.1933809 0.1008407 0.2270996 0.4320058 0.1444412 0.1213991 0.3854595 0.9641382 -0.4698574 -0.0873817 -0.0433453 -0.0218402 -0.2560775 0.1159405 -0.0546706 -0.2582526 -0.6701278 -0.4426824 0.1204955 -0.1704065 0.1172015 -0.8656968 0.2484404 -0.221678 0.2410821 -0.2309272 -0.2380449 0.0040332 -0.0888117 -0.1098585 -0.2316127 -0.0923433 -0.1768324 -0.044406 -0.2576186 0.1574458 -0.0525918 -0.1683512 -0.0466587 -0.0992621 -0.0724874 -0.113516 -0.0391955 -0.0512361 0.1727954 -0.7279571 0.2565534 -0.2159315 0.0464332 -0.0954936 0.1167256 -0.3469477 0.1409477 -0.2019495 0.3952779 -0.1707189 -0.2582798 0.9017924 -0.2387273 -0.0681431 -0.0306723 -0.0319864 -0.2053294 -0.0697759 0.1671263 0.0662605 -0.0777857 -0.1068049 -0.0255463 0.0057408 -0.0835539 -0.2089791 0.0432725 -0.0155307 -0.0430972 -0.0894852 0.0079289 0.2322737 -0.0447103 -0.1398719 0.258189 0.3631362 -0.0048827 0.4073968 1.5748842 -0.223083 0.0668221 -0.1336178 0.0872634 1.0124905 -0.5307179 0.5573549 -0.4863532 0.4717583 -0.3370281 0.6617653 -0.3802745 0.4201542 -0.097543 -0.0264756 -0.0338157 -0.0370743 -0.0851289 -0.0411989 0.0305879 -0.0898058 0.0895446 0.0563626 -0.1504927 0.0835694 -0.1285536 -0.025585 -0.0833357 -0.0061314 -0.0219714 -0.019883 0.0209696 -0.0852188 -0.1039542 -0.0730153 -0.0862556 0.0128577 -0.0743235 0.01113 0.0217286 0.0566896 0.1022331 -0.0471261 0.0794463 0.0912123 0.0286609 -0.0425872 0.0042722 0.1044686 0.2169395 0.0093634 0.0312142 0.0022996 0.1167168 0.02429 -0.0327388 0.0295084 0.0706446 0.0776428 0.0337151 0.0203937 0.0340399 0.113097 0.0676445 0.0459723 0.0728117 -0.0796637 -0.026664 0.0982525 -0.0116456 0.1289581 0.0780346 0.0401997 -0.0135923 0.0486126 0.0607725 -0.0106692 0.0582391 0.1026106 0.0678792 0.1242521 -0.0203784 0.1136754 -0.0158605 0.0209069 unknown
polarizability: 232.7274119|-13.9373461|191.9662972|19.8425137|-33.1149121|154.1134125 unknown
InChI: InChI=1S/C11H5Cl4NOS/c12-7-9(8(13)11(15)16-10(7)14)18(17)6-4-2-1-3-5-6/h1-5H
charge 0 multiplicity 1
23 atoms
Cl -0.172316 2.238257 -1.57236
Cl 1.591628 -2.71004 0.403822
Cl 2.598742 3.528539 -0.461149
Cl 4.27515 -1.166755 1.476518
S  -0.638057 -1.201747 -1.393433
O  -1.09714 -0.449725 -2.789752
N  3.175516 1.037153 0.376587
C  0.859314 -0.184062 -0.585322
C  -1.956521 -0.663568 -0.108201
C  1.05297 1.19933 -0.771547
C  1.829366 -0.935841 0.106499
C  -1.907573 -1.146176 1.212748
C  -2.993364 0.144381 -0.598283
C  2.255095 1.766106 -0.265593
C  2.988302 -0.272671 0.577243
C  -2.95293 -0.772939 2.090653
C  -4.030241 0.507398 0.292677
C  -4.008115 0.051316 1.631612
H  -1.092151 -1.790164 1.560216
H  -2.971352 0.469352 -1.645552
H  -2.941795 -1.128641 3.126355
H  -4.851006 1.140936 -0.059649
H  -4.814825 0.333461 2.316813
