program: Gaussian 09
title: 000287180
version: EM64L-G09RevD.01
frameworkgroup: C1[X(C17H14N2O3)]
method: RPBEPBE
basis: SDD
operation: Freq
keyword: #p
keyword: freq=noraman
keyword: PBEPBE/SDD
title: #p freq=noraman PBEPBE/SDD
converged: YES YES NO NO
title: Mulliken charges:
elementType: O O O N N C C C C C C C C C C C C C C C C C H H H H H H H H H H H H H H
charge: -0.220762 -0.381885 -0.287121 -0.161651 0.003772 0.322225 0.151878 -0.372999 -0.529259 0.424623 -0.323815 0.079227 0.106076 -0.394421 -0.432460 0.330918 -0.661753 0.104007 -0.333630 -0.333306 -0.346342 -0.347480 0.236264 0.235575 0.254392 0.287063 0.288330 0.251076 0.241104 0.239940 0.230878 0.242731 0.232097 0.244182 0.241958 0.378568
chargesum: 0.00000
title: Mulliken charges with hydrogens summed into heavy atoms:
elementType: O O O N N C C C C C C C C C C C C C C C C C
charge: -0.220762 -0.003316 -0.287121 -0.161651 0.003772 0.322225 0.151878 0.098840 -0.274867 0.424623 -0.036752 0.079227 0.106076 -0.106091 -0.181384 0.330918 0.050169 0.104007 -0.090899 -0.101209 -0.102160 -0.105522
polarizability: 3.62281072e+02 8.02319005e+00 2.19367462e+02 -2.59626957e+00 4.09766609e-01 9.88956655e+01
1716.lowfreq: -4.2100 -1.5877 -0.0006 -0.0006 -0.0005 4.2465 27.4570 36.2401 44.6919
frequency: 27.4371 36.2302 44.6708 61.9548 70.5828 92.2899 102.5198 142.9896 164.6137 197.6657 212.1141 220.1681 245.9681 261.3293 319.8088 330.2850 369.0412 369.7390 379.5128 395.9191 415.3359 431.1901 478.1682 505.8196 519.4080 547.6206 572.0171 599.1503 630.1790 638.8608 645.5625 662.5472 682.4293 702.8345 736.8343 748.7419 759.8161 797.4014 802.5650 820.5280 828.7649 871.1453 878.1346 879.4173 899.8903 948.9733 960.8423 962.7114 964.0727 974.4399 1005.4513 1025.3910 1048.6734 1059.6000 1064.3497 1089.3528 1090.0897 1111.3702 1134.4406 1167.0760 1217.6011 1225.7885 1240.0105 1261.1192 1277.1867 1289.4757 1303.5835 1326.2417 1336.3630 1352.8515 1368.9684 1382.5129 1395.9110 1400.5166 1407.7770 1455.3074 1459.7799 1469.9149 1482.3083 1489.2333 1504.8174 1531.7493 1554.2000 1561.7244 1584.8618 1588.0266 1621.6251 1630.3052 2996.2985 3025.6645 3075.3840 3095.1681 3104.8680 3128.7210 3133.8503 3145.2713 3150.4504 3152.0452 3160.8159 3161.9705 3166.0889 3492.9430
redmass: 7.3069 10.4590 3.8813 7.6955 5.2260 3.4408 3.6247 5.8734 5.5673 1.4050 3.4564 5.8771 3.3070 4.9828 6.9185 3.8319 3.2332 4.3343 5.7041 4.4193 4.7912 3.4168 5.1897 4.7138 4.4129 3.7184 4.8431 1.4861 4.0464 6.1083 4.1746 6.5539 3.0297 5.8885 4.9037 3.2618 5.4678 1.2888 3.6452 1.8156 2.5201 1.6033 1.7171 1.2629 6.3873 2.4386 4.6051 1.4190 1.4698 1.5395 1.3475 4.1705 2.7004 3.4434 2.1767 1.9260 1.6743 2.2322 1.6468 1.5275 1.9257 1.3114 2.3953 1.5783 1.6216 3.2629 2.5006 1.7975 1.7141 1.5684 2.7675 3.6845 3.6668 1.2195 2.5154 3.1031 2.3270 1.0686 1.1740 1.8518 1.2521 6.9843 8.4970 7.2724 6.2559 6.7214 7.0568 7.3276 1.0361 1.0618 1.1023 1.0994 1.1023 1.0873 1.0885 1.0879 1.0928 1.0962 1.0978 1.0914 1.0954 1.0635
irintensity: 0.1773 3.6163 1.2184 2.0127 1.5797 0.2365 0.5563 0.1627 1.6151 0.9062 0.6333 1.3683 1.3562 2.5162 2.8842 3.5512 3.6426 7.9912 2.6939 6.5639 2.8635 5.4762 8.2761 6.1586 1.4215 8.4177 34.3163 106.3293 40.7400 45.2441 13.0427 3.9753 13.8295 11.8565 25.9415 0.5323 2.9284 7.5311 39.8946 47.8054 24.9294 9.3510 12.3068 0.3597 16.9448 2.9306 2.6932 12.5011 0.3513 1.7084 1.4306 123.9914 24.6150 121.8195 90.7341 8.1231 4.1939 123.6396 4.4212 20.3431 38.8878 8.6733 9.1727 31.5293 19.7954 2.5087 9.6254 3.0840 42.3822 37.4193 5.4061 32.0418 10.4082 16.2660 28.4610 47.8328 163.4578 2.5735 8.1009 29.1475 17.0321 79.5966 107.6712 84.0100 373.7213 104.4198 133.7105 247.0177 14.8619 25.3090 0.9119 30.9334 30.9562 12.1266 18.8436 0.9807 2.3632 27.6259 2.8458 14.4852 7.2113 37.0635
temp: 298.150 k
press: 1.00000 atm
elementType: 8 8 8 7 7 6 6 6 6 6 6 6 6 6 6 6 6 6 6 6 6 6 1 1 1 1 1 1 1 1 1 1 1 1 1 1
symmnumber: 1
zpe: 720243.7 jmol-1
zpe.correction: 0.274326 hartree
zpe.thermalcorrener: 0.292885 hartree
zpe.thermalcorrenthalpy: 0.293829 hartree
zpe.thermalcorrgfe: 0.226103 hartree
zpe.sumelectzpe: -989.867786 hartree
zpe.sumelectthermal: -989.849227 hartree
zpe.sumelectthermalent: -989.848283 hartree
zpe.sumelectthermalfe: -989.916008 hartree
dipole: 2.0406 4.5745 -0.5803
dipole: 5.0425
quadrupole: -160.7851 -117.2564 -128.7569
quadrupole: -8.8364 0.3331 2.9941
quadrupole: -25.1857 18.3431 6.8426 -8.8364 0.3331 2.9941
hfenergy: -990.1421118 hartree
pointgroup: C01 [X(C17H14N2O3)]
dipole: 0.7819567 1.8085153 -0.2313295 debye
polarizability: 362.0762735|9.8576133|219.5991363|0.1233558|-0.2735171|98.8687893 unknown
InChI: InChI=1S/C17H14N2O3/c1-2-19-10-14(17(21)22)16(20)13-4-3-12(9-15(13)19)11-5-7-18-8-6-11/h3-10,21H,2H2,1H3
charge 0 multiplicity 1
36 atoms
O  -2.883486 -2.493949 0.341794
O  -5.42692 -1.38366 0.064408
O  -5.553493 0.885427 -0.365732
N  -1.448415 1.38032 -0.390308
N  6.098299 0.234318 -0.033383
C  -0.5185 0.332102 -0.155442
C  -1.023874 -0.983602 0.081842
C  -1.001063 2.785409 -0.607743
C  0.88234 0.564205 -0.167965
C  1.79399 -0.495009 0.041213
C  -2.793071 1.114711 -0.361171
C  -2.491651 -1.304771 0.116711
C  -3.36051 -0.137168 -0.126467
C  -0.097055 -2.035365 0.293091
C  1.284247 -1.807243 0.272137
C  3.262466 -0.242748 0.019654
C  -0.664924 3.5187 0.70662
C  -4.84465 -0.141811 -0.157998
C  4.172472 -1.215881 -0.475528
C  3.822428 0.975838 0.491086
C  5.556263 -0.937986 -0.482159
C  5.220042 1.166751 0.444671
H  -0.137204 2.780188 -1.294904
H  -1.818509 3.308654 -1.132196
H  1.277095 1.563114 -0.371043
H  -3.46571 1.959985 -0.540863
H  -0.516132 -3.0297 0.479359
H  1.977392 -2.631952 0.4665
H  -1.550761 3.571842 1.36296
H  0.142048 3.012544 1.263342
H  -0.337814 4.550588 0.486439
H  3.810661 -2.167594 -0.877707
H  3.186338 1.756674 0.921483
H  6.270433 -1.675378 -0.865475
H  5.668128 2.097933 0.809604
H  -6.4165 -1.267288 0.021372
