program: Gaussian 09
title: 000287161
version: EM64L-G09RevD.01
frameworkgroup: C1[X(C11H14O)]
method: RPBEPBE
basis: SDD
operation: Freq
keyword: #pfreq=noraman
keyword: PBEPBE/SDD
title: #p freq=noraman PBEPBE/SDD
converged: YES YES NO NO
title: Mulliken charges:
elementType: O C C C C C C C C C C C H H H H H H H H H H H H H H
charge: -0.277774 -0.103679 -0.577393 0.219885 0.210675 0.051609 -0.407935 -0.403461 -0.219893 -0.215078 -0.694484 -0.685169 0.203676 0.227358 0.235745 0.187980 0.252199 0.242730 0.222639 0.222182 0.197551 0.232231 0.223110 0.211886 0.217456 0.225954
chargesum: 0.00000
title: Mulliken charges with hydrogens summed into heavy atoms:
elementType: O C C C C C C C C C C C
charge: -0.277774 0.099997 -0.114290 0.219885 0.210675 0.239589 -0.155737 -0.160731 0.002745 0.007104 -0.041592 -0.029873
polarizability: 1.59974321e+02 3.38093517e+00 1.17187944e+02 -7.50509732e+00 1.02587789e+00 7.80690681e+01
1716.lowfreq: -5.5793 -0.0008 -0.0005 -0.0002 5.3600 10.6153 29.6163 54.8421 78.3927
frequency: 28.9335 54.8322 78.3405 145.3056 177.1708 205.5423 224.0392 245.6846 318.6114 375.5082 396.2634 404.7046 456.9190 476.5075 523.3451 575.8363 632.3472 708.5424 731.2371 761.3059 811.3629 815.0730 872.2241 885.1950 899.9898 918.6869 935.8759 942.6726 976.9939 985.9755 998.4734 1035.6010 1080.3842 1098.5614 1108.3144 1134.9240 1146.3584 1160.0576 1164.0866 1177.0778 1193.6253 1218.4671 1273.0030 1291.7305 1327.1086 1342.1323 1377.6234 1392.4325 1400.8467 1435.0965 1445.6718 1452.7519 1454.2436 1465.1963 1470.7423 1485.4855 1611.9460 1621.5705 2937.1485 2956.8349 2982.1976 2990.5049 3006.1266 3074.1778 3075.6937 3085.4533 3092.0500 3098.9036 3120.7568 3135.3930 3149.0265 3161.2165
redmass: 2.7698 3.8306 3.6064 2.9531 1.0905 2.2093 1.3166 3.8272 2.9050 2.6821 2.6657 3.1739 2.8492 3.2787 2.6528 5.2496 5.1281 3.1621 1.9526 1.6230 3.5805 3.3409 1.3752 2.9548 2.7559 1.2336 1.3626 1.4945 2.8415 1.3364 2.1327 3.1958 2.1424 1.4856 1.7744 1.6942 2.0253 1.2916 1.2489 1.8667 1.5424 2.2912 1.4613 1.2609 1.3817 1.3689 1.2649 1.2301 3.4892 1.2807 2.3203 2.5786 1.0688 1.0528 1.0489 1.0489 7.6228 7.6284 1.0840 1.0833 1.0360 1.0357 1.0587 1.0992 1.1056 1.1004 1.0996 1.1000 1.0852 1.0901 1.0958 1.0997
irintensity: 0.0976 1.0328 1.6004 2.8737 0.4653 3.5977 1.1082 2.7466 0.6149 2.9592 6.5950 2.4239 3.0221 3.6261 1.2465 2.1988 3.4901 3.1090 35.5440 42.7104 2.0106 9.0301 0.2924 4.6282 11.8493 2.1949 0.0463 1.1508 31.2563 1.5713 7.3559 115.6496 9.0685 44.2671 69.8581 8.3792 14.7600 3.9219 8.4679 31.4918 0.9942 1.2644 1.0141 67.0653 9.5770 0.7817 36.2823 25.4681 12.1095 7.2946 4.4634 9.1567 7.2844 2.7213 7.5265 14.7663 0.7049 2.7805 42.0994 40.8457 29.6961 23.4435 46.2925 30.2931 30.6332 10.4583 59.0314 34.8583 0.5032 12.2979 34.1283 26.1389
temp: 298.150 k
press: 1.00000 atm
elementType: 8 6 6 6 6 6 6 6 6 6 6 6 1 1 1 1 1 1 1 1 1 1 1 1 1 1
symmnumber: 1
zpe: 572975.5 jmol-1
zpe.correction: 0.218235 hartree
zpe.thermalcorrener: 0.229975 hartree
zpe.thermalcorrenthalpy: 0.230919 hartree
zpe.thermalcorrgfe: 0.179669 hartree
zpe.sumelectzpe: -501.848007 hartree
zpe.sumelectthermal: -501.836267 hartree
zpe.sumelectthermalent: -501.835323 hartree
zpe.sumelectthermalfe: -501.886573 hartree
dipole: 0.8171 1.0675 -0.9936
dipole: 1.6717
quadrupole: -62.8496 -67.5916 -74.7493
quadrupole: 1.9600 -2.3747 0.8095
quadrupole: 5.5472 0.8052 -6.3525 1.9600 -2.3747 0.8095
hfenergy: -502.066242 hartree
pointgroup: C01 [X(C11H14O1)]
dipole: -0.3141271 0.2559405 0.5180495 debye
dipolederiv: -1.4328749 -0.0995956 -0.0897213 0.0232671 -0.417864 0.0432213 -0.2610227 0.0115758 -0.4463751 1.0128633 0.1559905 0.1192198 0.184716 0.3612265 -0.0165561 0.5118273 -0.0251551 0.4472084 -0.1415539 -0.0870034 -0.0009154 -0.0810433 -0.1336252 -0.0319885 -0.0370163 0.0144624 0.1409913 0.0049209 -0.0494439 -0.0778681 0.2175375 -0.1259898 -0.0567825 -0.0561547 0.0013099 -0.1029159 0.0591448 -0.0523147 -0.0386513 -0.2900769 0.0243698 0.0625028 -0.11511 0.0156543 -0.0447321 1.0050133 0.0314009 -0.0175494 -0.0905933 0.3954206 -0.0794917 -0.1922455 -0.0707296 0.3486556 -0.0190714 0.0696622 0.0064639 -0.0267271 0.1054165 0.0615877 0.0190187 0.0673926 -0.0940841 -0.0544987 0.1015407 0.0090259 0.1360517 0.0737495 0.0389916 0.0212287 0.0427883 -0.1283756 -0.0720074 -0.0331467 -0.0443017 -0.1082548 -0.007592 0.0754511 -0.0599341 0.0650076 -0.1344501 0.0451453 0.008327 -0.0518268 0.0940622 -0.0440377 0.0208585 -0.0195337 0.0332308 -0.1436321 -0.0838012 -0.0161854 -0.0627125 0.0156988 0.0504481 0.0444851 -0.0677872 0.0474557 -0.0907339 -0.1281765 -0.0564825 0.0370054 -0.0440502 -0.0375962 0.1274729 0.1270798 0.1120928 -0.0922631 -0.0995135 -0.0424745 0.0754561 -0.061757 -0.0215247 0.0851828 -0.009469 0.083038 -0.1568532 0.0099519 0.0326255 0.0366817 -0.0044787 0.0316541 -0.0902263 0.0662196 -0.1326701 -0.1273506 -0.01224 0.1077286 -0.0252567 0.1039262 -0.0123515 0.0506296 -0.0586123 0.0864801 0.0143209 -0.0435815 -0.0556097 -0.0224333 0.0087013 -0.1771924 -0.0767835 0.036352 -0.0816769 -0.0339912 0.0790865 -0.0725484 -0.0023594 -0.0491616 -0.0604673 -0.0521232 0.0038387 -0.0521649 0.1367384 0.0534718 -0.0643288 0.0030528 -0.0938994 -0.0735782 -0.0511518 -0.0036473 -0.0524262 0.143231 -0.0218773 0.0937025 0.0679222 0.0968344 -0.0148867 -0.0756896 0.069804 -0.0796787 0.1179969 -0.1423363 -0.0414833 0.0533212 -0.0358664 0.0837365 -0.0139234 0.0589759 -0.0157508 0.1384106 -0.1817368 0.0710525 0.0177587 0.0780897 0.0800111 -0.0153396 0.0460639 -0.0314094 0.0655657 0.08203 -0.0771254 0.0725673 -0.0598283 -0.0099142 0.1113897 0.0417256 0.100168 -0.0300828 0.1071191 0.0108148 -0.0047009 -0.0354572 -0.1002421 -0.1129401 -0.0316495 -0.0548426 0.0439174 -0.1785858 0.0471109 0.0756638 0.0658677 0.0608942 -0.0206075 0.0673871 -0.0046388 0.0914141 0.0492696 0.0213133 -0.1480213 0.0041518 0.0680572 0.023757 -0.1403214 0.0320275 -0.1019916 0.1038388 -0.0035271 0.0121795 -0.0477103 -0.098122 -0.0519264 -0.0170179 -0.1115406 0.039381 unknown
polarizability: 159.5816979|0.3347706|113.2526778|-10.0656717|11.6745601|82.3969576 unknown
InChI: InChI=1S/C11H14O/c1-8(2)12-11-7-9-5-3-4-6-10(9)11/h3-6,8,11H,7H2,1-2H3
charge 0 multiplicity 1
26 atoms
O  -1.633875 -0.287766 -0.4110
C  -0.596178 -0.09186 0.587359
C  -0.050935 1.407816 0.802164
C  0.810742 -0.440243 0.093442
C  1.314061 0.856029 0.358347
C  -2.989853 0.148372 0.018441
C  1.607358 -1.474383 -0.417307
C  2.663605 1.185356 0.160389
C  2.974628 -1.14788 -0.639201
C  3.489151 0.144541 -0.35151
C  -3.804132 0.251527 -1.276721
C  -3.608367 -0.839572 1.027612
H  -0.867498 -0.579347 1.547566
H  -0.12213 1.814707 1.826554
H  -0.504217 2.117748 0.087484
H  -2.904528 1.155026 0.486316
H  1.218687 -2.473174 -0.640854
H  3.074255 2.179649 0.366983
H  3.653569 -1.909408 -1.040514
H  4.551488 0.342602 -0.537826
H  -4.833846 0.592707 -1.065319
H  -3.329259 0.961404 -1.975121
H  -3.854366 -0.735023 -1.770943
H  -4.625964 -0.51132 1.309998
H  -3.012245 -0.914329 1.954971
H  -3.677552 -1.845775 0.577288
