program: Gaussian 09
title: 000287225
version: EM64L-G09RevD.01
frameworkgroup: C1[X(C21H19Cl2N3O3)]
method: RPBEPBE
basis: SDD
operation: Freq
keyword: #p
keyword: freq=noraman
keyword: PBEPBE/SDD
title: #p freq=noraman PBEPBE/SDD
converged: YES YES NO NO
title: Mulliken charges:
elementType: Cl Cl O O O N N N C C C C C C C C C C C C C C C C C C C C C H H H H H H H H H H H H H H H H H H H
charge: 0.017345 0.014637 -0.480303 -0.439271 -0.249702 -0.368115 -0.111617 -0.111011 -0.077560 -0.299695 0.424102 -0.393676 -0.369333 -0.414480 -0.351199 -0.290852 0.376747 0.161956 0.191619 0.436970 0.015966 -0.714691 -0.365470 -0.441292 -0.309920 -0.421084 -0.217364 -0.235283 -0.236679 0.278002 0.263751 0.269806 0.243988 0.362493 0.269495 0.257939 0.359551 0.253499 0.269733 0.352735 0.356604 0.270671 0.241984 0.276688 0.239953 0.231146 0.230521 0.230695
chargesum: 0.00000
title: Mulliken charges with hydrogens summed into heavy atoms:
elementType: Cl Cl O O O N N N C C C C C C C C C C C C C C C C C C C C C
charge: 0.017345 0.014637 -0.120752 -0.086536 -0.249702 -0.005623 -0.111617 -0.111011 0.200443 -0.035944 0.424102 0.120118 -0.099838 -0.156541 -0.097700 -0.021119 0.376747 0.161956 0.191619 0.436970 0.015966 -0.358087 -0.094799 -0.199308 -0.033232 -0.181131 0.013782 -0.004762 -0.005984
polarizability: 5.86807542e+02 2.07242569e+01 2.86678757e+02 3.11152914e+01 -2.46354804e+01 1.64668439e+02
1716.lowfreq: -4.6165 -2.3056 -0.0015 -0.0007 0.0014 4.1281 10.0165 11.7300 17.2144
frequency: 8.5893 11.6188 16.9363 22.0202 38.8689 44.3385 47.6889 54.5091 69.5784 78.7669 97.3163 124.2129 146.9064 159.7608 166.9759 171.3887 189.9408 201.5619 224.2717 235.8153 248.1675 264.1014 272.2316 287.2604 319.4962 334.5984 348.5288 382.6760 388.2963 393.3792 408.4394 413.6460 440.6213 471.0442 476.6536 492.0424 508.6343 538.3154 550.6325 568.4146 569.8017 583.1592 617.5823 630.9451 649.0286 652.8289 690.9682 693.7661 734.0778 743.0450 750.7887 753.0844 754.7961 782.5615 788.9814 824.7399 829.4313 852.7380 855.6101 861.0100 867.9551 893.4591 898.7981 916.6109 942.1476 945.5883 974.3688 975.6758 984.5094 994.1909 996.5264 1001.2974 1004.0993 1006.0873 1014.2290 1031.5154 1056.0727 1079.7603 1106.9119 1113.8489 1138.0947 1153.6749 1167.0478 1173.7904 1178.7463 1187.8602 1192.2417 1201.0288 1207.3439 1213.7443 1225.7675 1240.3858 1251.0237 1269.2239 1278.8549 1285.8955 1311.6870 1333.9033 1338.2442 1348.8569 1370.3068 1373.7375 1379.7705 1396.3888 1402.4321 1417.8682 1420.6757 1440.1163 1445.9746 1473.6813 1483.5086 1486.0915 1514.6187 1571.5311 1573.2067 1584.6464 1610.1504 1618.0411 1630.6107 2984.2676 2997.4726 3029.4633 3103.3426 3124.7181 3124.7953 3126.9979 3137.7235 3140.6962 3148.9162 3158.5246 3162.8057 3164.1522 3169.2832 3171.1176 3177.4607 3450.1835 3558.3954 3585.5466
redmass: 6.8084 8.2343 10.2097 6.2279 5.8933 6.3055 7.3884 6.2126 5.9439 10.6379 6.6527 5.8477 6.1263 6.0631 5.2619 8.6255 4.4171 8.2187 5.5647 5.5086 5.2830 4.7021 5.4062 4.5028 2.5500 1.5127 1.5266 2.6724 9.1107 5.1876 2.9351 3.2784 3.8845 3.2987 6.4352 5.8379 6.1967 3.3230 6.7221 4.7304 4.8295 4.5194 6.2104 6.6333 5.4667 3.3244 3.5858 3.3056 1.8836 4.3479 1.7683 7.4688 2.2948 5.4529 1.7500 4.5365 1.6000 2.3309 1.3672 4.2888 1.9785 1.7926 5.8835 2.2117 1.4022 3.9295 3.2803 1.3896 1.4847 1.3900 1.3813 3.1814 1.3416 3.7567 3.5993 2.5547 1.6443 2.0105 1.3691 3.0098 1.5990 1.4098 1.1295 1.2065 1.1847 1.0724 1.8930 1.3755 1.8737 1.3801 2.4175 2.0114 1.5541 1.9122 2.0037 1.3854 1.3770 1.8267 1.2465 5.2251 1.3028 2.2042 1.3414 3.2681 4.7786 4.9020 2.9174 2.6179 2.3568 1.0792 2.5218 1.9532 3.9452 6.5466 7.0081 5.9047 6.3984 8.4913 6.7443 1.0826 1.0846 1.0626 1.1046 1.0875 1.0895 1.0869 1.0904 1.0882 1.0930 1.0968 1.0897 1.0962 1.0962 1.0940 1.0964 1.0772 1.0662 1.0665
irintensity: 0.1998 0.1763 0.0843 0.7205 0.3311 1.1029 0.6620 2.1971 4.0068 2.1741 0.6360 2.5934 0.8861 2.8396 2.3513 7.1704 0.2798 6.0207 0.8006 3.1659 9.2567 5.6205 2.8230 5.2772 48.4154 134.2320 113.9736 65.8911 19.3688 13.3035 1.8833 6.1338 4.6286 0.5164 17.7177 12.1716 8.5463 44.5780 1.4376 3.1873 14.8490 34.0239 70.8883 7.7601 2.0660 1.5786 1.7730 89.0979 62.8693 24.2647 9.1361 24.6146 6.1724 0.8604 90.6075 4.7603 45.3267 31.5859 2.2904 1.1898 61.3297 4.8945 1.0638 6.9450 0.3486 46.1564 78.8061 1.8303 15.6597 1.1569 3.6467 12.6120 0.4202 19.9997 8.4115 8.9839 45.2662 5.4552 8.7720 4.8520 1.0715 4.7910 3.4575 41.5921 0.8269 10.2774 39.3608 4.2322 37.7821 31.2413 40.9831 20.2471 30.9727 7.4463 1.0271 23.7065 13.9181 3.3763 16.6818 42.3283 15.6569 7.7467 5.2583 2.5077 4.5966 25.0640 7.7502 12.0409 7.9510 20.2968 83.1317 488.4782 24.1510 8.8264 3.7240 15.8394 33.1100 262.8314 1.9062 5.1228 24.6711 21.0072 27.0717 5.4708 5.7122 1.1811 15.2011 7.2728 26.4197 38.8254 0.8387 7.1925 17.5706 2.1912 15.3960 100.1545 7.7236 20.2596
temp: 298.150 k
press: 1.00000 atm
elementType: 17 17 8 8 8 7 7 7 6 6 6 6 6 6 6 6 6 6 6 6 6 6 6 6 6 6 6 6 6 1 1 1 1 1 1 1 1 1 1 1 1 1 1 1 1 1 1 1
symmnumber: 1
zpe: 945333.8 jmol-1
zpe.correction: 0.360059 hartree
zpe.thermalcorrener: 0.387196 hartree
zpe.thermalcorrenthalpy: 0.388140 hartree
zpe.thermalcorrgfe: 0.296498 hartree
zpe.sumelectzpe: -2119.578519 hartree
zpe.sumelectthermal: -2119.551382 hartree
zpe.sumelectthermalent: -2119.550438 hartree
zpe.sumelectthermalfe: -2119.642080 hartree
dipole: 3.6599 -1.0569 -2.0779
dipole: 4.3393
quadrupole: -169.3483 -175.2696 -187.3910
quadrupole: 3.2213 10.0303 -5.5106
quadrupole: 7.9880 2.0667 -10.0547 3.2213 10.0303 -5.5106
hfenergy: -2119.938578 hartree
pointgroup: C01 [X(C21H19Cl2N3O3)]
dipole: -1.4916762 -0.8166898 0.1499064 debye
polarizability: 580.4235775|-61.7114256|186.6462927|-3.8289223|48.9455163|271.0848671 unknown
InChI: InChI=1S/C21H19Cl2N3O3/c22-20(23)21(29)24-18(12-27)19(28)14-8-10-15(11-9-14)25-26-17-7-3-5-13-4-1-2-6-16(13)17/h1-11,18-20,24,27-28H,12H2
charge 0 multiplicity 1
48 atoms
Cl 8.677081 0.122555 1.075597
Cl 8.145569 -2.165267 -0.916641
O  3.919729 -2.423114 -0.04611
O  4.308939 1.311328 1.775022
O  6.505732 1.359395 -1.428493
N  5.615304 -0.458574 -0.24169
N  -2.253052 -0.709107 -1.019586
N  -3.085063 -0.222444 -0.131661
C  4.198202 -0.042939 -0.32251
C  3.344337 -1.12784 0.388197
C  1.866812 -1.015658 0.047757
C  3.975109 1.338311 0.34426
C  1.380397 -1.465937 -1.206907
C  0.958392 -0.45356 0.98493
C  0.013262 -1.3480 -1.519566
C  -0.407831 -0.329638 0.679097
C  6.6304 0.253053 -0.81689
C  -0.891683 -0.779903 -0.582391
C  -5.388684 0.360449 0.416257
C  -6.78104 0.490392 0.033192
C  -4.442063 -0.126626 -0.567376
C  8.048463 -0.311406 -0.641889
C  -5.002381 0.716083 1.749134
C  -7.179487 0.137763 -1.29632
C  -4.875778 -0.4629 -1.866811
C  -7.730675 0.969702 0.996722
C  -6.241766 -0.329485 -2.227202
C  -5.951001 1.179838 2.664557
C  -7.326089 1.308541 2.288441
H  3.895699 0.033694 -1.386994
H  3.486271 -1.003604 1.481389
H  4.558701 2.105823 -0.194066
H  2.905465 1.596684 0.299856
H  5.768672 -1.441527 0.021452
H  2.076967 -1.914052 -1.923739
H  1.336893 -0.105226 1.954118
H  3.407961 -3.161266 0.368596
H  -0.385579 -1.686937 -2.481258
H  -1.115564 0.105603 1.390367
H  5.290096 1.206272 1.867522
H  8.737653 0.157799 -1.352554
H  -3.95008 0.614825 2.026239
H  -8.234397 0.239701 -1.577926
H  -4.133667 -0.824823 -2.584824
H  -8.781721 1.064578 0.699288
H  -6.561524 -0.593538 -3.240962
H  -5.64323 1.449723 3.680852
H  -8.056652 1.67406 3.018219
