program: Gaussian 09
title: 000287150
version: EM64L-G09RevD.01
frameworkgroup: C1[X(C12H15N3O2)]
method: RPBEPBE
basis: SDD
operation: Freq
keyword: #p
keyword: freq=noraman
keyword: PBEPBE/SDD
title: #p freq=noraman PBEPBE/SDD
converged: NO YES NO NO
title: Mulliken charges:
elementType: O O N N N C C C C C C C C C C C C H H H H H H H H H H H H H H H
charge: -0.340614 -0.257704 -0.055063 -0.342875 -0.366414 -0.578807 0.367722 0.142242 -0.622679 0.193243 0.216112 -0.512337 0.459718 -0.340112 -0.433734 -0.810154 -0.532583 0.252377 0.261680 0.274013 0.268206 0.392618 0.258981 0.240394 0.233073 0.222218 0.235390 0.231027 0.234965 0.230156 0.246954 0.231983
chargesum: 0.00000
title: Mulliken charges with hydrogens summed into heavy atoms:
elementType: O O N N N C C C C C C C C C C C C
charge: -0.340614 -0.257704 -0.055063 0.049743 -0.131449 -0.064749 0.367722 0.142242 -0.080460 0.193243 0.216112 -0.253355 0.459718 -0.099718 -0.200662 -0.121518 0.176510
polarizability: 1.72998089e+02 -7.41710535e+00 1.85316746e+02 4.92311149e+00 7.12238821e+00 1.10371516e+02
1716.lowfreq: -3.3415 -0.0005 -0.0005 0.0004 3.6700 6.9495 21.8857 39.9879 53.2212
frequency: 21.6755 39.9185 53.2009 64.8597 88.4981 115.1690 138.8976 159.6711 166.1230 202.3407 223.9540 235.0703 282.0367 304.9074 342.8190 348.2286 369.2387 441.1003 451.8317 475.6235 496.3317 531.3544 537.9739 550.5206 581.1066 609.9558 650.8822 667.6339 694.6299 724.1085 732.9533 766.6308 808.4513 821.3999 867.1634 906.2213 919.5364 941.7917 944.7742 949.7287 984.6340 988.1759 1008.5037 1050.1409 1099.1592 1116.6030 1131.5677 1136.4752 1148.1170 1162.4055 1176.3941 1207.3944 1219.3732 1246.6666 1259.6856 1288.4675 1304.8980 1337.6579 1354.7414 1376.3801 1399.1422 1419.2710 1420.1267 1436.5037 1440.9964 1466.5992 1469.5443 1472.2422 1474.7881 1477.9407 1497.3078 1596.9927 1620.3979 1625.4156 1673.6341 2972.0037 2977.1189 3007.4895 3027.6093 3055.5703 3065.9934 3084.6294 3089.4334 3093.4458 3126.0630 3126.9999 3129.9560 3164.4928 3406.0409 3435.4102
redmass: 6.3733 4.7397 1.0920 4.1090 3.0639 4.2737 3.3040 3.5346 5.6503 4.7589 3.4293 1.2574 4.5209 2.3526 3.5402 3.8642 4.6120 3.4226 3.9878 2.1841 3.4003 3.6150 3.9447 3.7764 7.5183 4.4371 1.6174 2.7195 4.6795 4.3241 1.1443 4.1145 1.4247 3.5907 3.6237 1.5069 2.9057 1.5606 2.4330 1.7658 5.0966 2.5543 1.6305 1.5476 2.3603 1.2599 1.1655 2.1089 1.4390 2.3356 1.5032 2.2046 1.8028 2.9527 2.0039 1.7552 1.6583 2.9413 1.3174 4.6614 1.2652 1.4664 1.9363 1.2044 1.1501 1.0729 1.0460 2.1190 1.0961 1.1319 2.1121 6.8211 6.4887 6.3406 9.3242 1.0319 1.0372 1.0635 1.0624 1.0975 1.1047 1.0990 1.0989 1.1001 1.0921 1.0997 1.0908 1.0942 1.0770 1.0844
irintensity: 0.4931 1.0238 0.5163 1.0803 3.9085 5.0088 8.8210 4.1423 0.4578 2.1218 3.2441 0.3796 1.3846 3.9297 7.1609 13.1023 8.9292 9.6276 0.9293 0.4220 1.5556 3.6300 23.8322 10.6979 13.1222 7.8786 145.1059 45.2258 15.0042 5.2587 73.8236 5.5573 50.5828 3.7771 2.5694 5.7497 7.0029 6.8298 3.8567 1.8592 93.5465 36.3292 11.1548 11.4582 198.4296 0.4331 1.6940 35.6774 5.0821 35.7499 21.3202 85.2466 13.2066 13.4533 2.2853 38.2051 56.6462 51.7078 4.1832 1.9425 12.8439 14.1741 4.8161 10.1108 18.1971 22.7443 12.5255 33.9620 41.5238 16.6531 61.5750 4.5733 5.2980 403.1578 320.6931 59.5534 34.5547 29.0783 1.9508 19.6076 36.7949 19.3662 0.9702 1.7991 9.1042 22.5881 6.1327 13.5327 7.7399 349.5914
temp: 298.150 k
press: 1.00000 atm
elementType: 8 8 7 7 7 6 6 6 6 6 6 6 6 6 6 6 6 1 1 1 1 1 1 1 1 1 1 1 1 1 1 1
symmnumber: 1
zpe: 670380.8 jmol-1
zpe.correction: 0.255335 hartree
zpe.thermalcorrener: 0.271952 hartree
zpe.thermalcorrenthalpy: 0.272896 hartree
zpe.thermalcorrgfe: 0.209812 hartree
zpe.sumelectzpe: -779.685739 hartree
zpe.sumelectthermal: -779.669121 hartree
zpe.sumelectthermalent: -779.668177 hartree
zpe.sumelectthermalfe: -779.731261 hartree
dipole: 4.0920 0.8944 -0.7647
dipole: 4.2578
quadrupole: -101.5556 -88.9420 -105.6671
quadrupole: 12.4729 8.5571 -9.1300
quadrupole: -2.8340 9.7796 -6.9455 12.4729 8.5571 -9.1300
hfenergy: -779.9410734 hartree
pointgroup: C01 [X(C12H15N3O2)]
dipole: 1.6426348 0.2000805 -0.2605071 debye
polarizability: 171.4024562|-6.4359296|186.0711341|6.5998903|9.2994056|111.2127602 unknown
InChI: InChI=1S/C12H15N3O2/c1-8-3-4-10(17-2)9(5-8)7-15-11(13)6-12(16)14-15/h3-5,13-14H,6-7H2,1-2H3
charge 0 multiplicity 1
32 atoms
O  0.659134 2.148132 -0.552285
O  -3.405949 1.643687 1.628223
N  -1.579872 -0.220029 -0.786271
N  -1.879381 0.959999 -0.034962
N  -2.15871 -2.510755 -0.776888
C  -0.320051 -0.314542 -1.533369
C  0.931451 -0.242846 -0.661538
C  -2.370193 -1.28611 -0.350975
C  -3.393495 -0.68185 0.623619
C  -2.933498 0.779143 0.83823
C  1.429459 1.007691 -0.196126
C  1.633268 -1.414409 -0.308849
C  2.815451 -1.38356 0.478191
C  2.607118 1.073135 0.577178
C  3.290434 -0.12189 0.90463
C  3.534736 -2.669484 0.84628
C  1.209316 3.471122 -0.230725
H  -0.301811 0.487784 -2.294024
H  -0.374054 -1.291288 -2.041694
H  -4.413085 -0.691114 0.197858
H  -3.42462 -1.221891 1.584133
H  -1.22539 1.749024 -0.123557
H  1.238316 -2.376976 -0.657305
H  2.999437 2.030323 0.932816
H  4.20433 -0.063308 1.507447
H  4.472532 -2.466629 1.391378
H  2.903998 -3.310761 1.49089
H  3.786083 -3.262854 -0.052382
H  -2.846393 -3.18648 -0.400806
H  1.283143 3.617658 0.86345
H  0.49536 4.192647 -0.654687
H  2.202535 3.606431 -0.697679
