program: Gaussian 09
title: 000287129
version: EM64L-G09RevD.01
frameworkgroup: C1[X(C19H13NO)]
method: RPBEPBE
basis: SDD
operation: Freq
keyword: #p
keyword: freq=noraman
keyword: PBEPBE/SDD
title: #p freq=noraman PBEPBE/SDD
converged: YES YES NO NO
title: Mulliken charges:
elementType: O N C C C C C C C C C C C C C C C C C C C H H H H H H H H H H H H H
charge: -0.285422 0.032410 0.219300 0.231147 0.213981 0.240068 -0.302840 -0.396639 -0.406066 -0.416633 -0.380668 -0.231456 -0.228689 -0.232268 -0.240302 0.374642 -0.340688 -0.385376 -0.197793 -0.194370 -0.253736 0.247767 0.249379 0.272110 0.287124 0.229244 0.230257 0.231672 0.232136 0.275399 0.242657 0.226228 0.228764 0.228660
chargesum: 0.00000
title: Mulliken charges with hydrogens summed into heavy atoms:
elementType: O N C C C C C C C C C C C C C C C C C C C
charge: -0.285422 0.032410 0.219300 0.231147 0.213981 0.240068 -0.302840 -0.148872 -0.156687 -0.144522 -0.093544 -0.002212 0.001568 -0.000596 -0.008166 0.374642 -0.065289 -0.142719 0.028435 0.034395 -0.025077
polarizability: 3.70249900e+02 -4.97800478e+00 2.82821779e+02 3.42278116e-01 -7.71535384e-01 7.93568846e+01
1716.lowfreq: -5.0692 0.0005 0.0006 0.0007 2.9885 5.0597 22.2164 38.4098 54.1253
frequency: 21.9780 38.4058 54.1199 92.2602 120.6158 137.4389 162.4283 190.7654 232.8738 249.3675 257.7459 311.4092 407.3170 409.9592 414.1066 425.9338 433.1693 469.4947 498.8828 509.0927 536.9940 568.2442 602.5730 611.0211 616.4412 650.8672 662.1509 691.8084 726.9752 746.8525 759.5888 760.5105 775.5452 797.4396 800.2543 802.6409 832.5782 888.8489 894.2948 897.9547 906.8103 954.3989 958.2376 964.0912 968.1759 985.6802 987.7347 990.6226 994.2248 994.5503 1018.8806 1020.0357 1035.4026 1078.0924 1082.4207 1106.1079 1149.0767 1158.0203 1169.4523 1170.4993 1176.3421 1189.8646 1222.3976 1240.3500 1297.7271 1304.5649 1310.8541 1377.7779 1388.4140 1403.3794 1438.6688 1443.9327 1445.2796 1463.5295 1467.8000 1477.3438 1563.6291 1590.1154 1595.3793 1598.8881 1607.2452 1615.5485 1621.8604 3127.4049 3129.1519 3131.1087 3139.9536 3140.8945 3142.6978 3154.6219 3157.2002 3160.6909 3168.6843 3170.3657 3196.8211 3197.6417
redmass: 3.8893 5.2751 5.3500 4.5774 5.4274 3.9751 5.8051 5.1439 5.7289 6.1449 5.5560 5.0885 3.3881 2.9472 6.5059 7.0881 3.7990 3.4407 3.0532 5.5449 8.4696 3.2637 7.2931 6.9268 6.9827 4.1478 6.9073 2.2274 5.7684 1.6160 1.5361 1.4874 6.4984 2.4629 7.2865 2.4356 1.2512 1.4281 10.8000 1.5700 1.4112 7.9909 1.4310 1.4258 1.3576 6.1723 1.3002 1.3493 6.4247 1.3390 2.0726 2.2312 1.8655 1.4814 2.6116 1.6653 1.8398 1.8222 1.0535 1.0856 1.2214 1.6996 2.2985 2.2190 1.7869 1.5020 1.5230 8.8065 9.9449 2.9087 2.2297 2.4358 2.8871 2.7932 2.2593 4.1659 9.5640 6.7716 6.8790 6.4326 6.9397 7.4472 7.7818 1.0860 1.0859 1.0850 1.0905 1.0897 1.0916 1.0948 1.0941 1.0981 1.0998 1.0999 1.0950 1.0942
irintensity: 0.1127 0.7606 0.0584 2.0734 0.7965 0.0216 0.3206 3.3029 0.0259 0.0134 0.2637 0.0540 1.6992 0.0207 0.7985 4.1926 6.1506 0.0600 11.9547 0.1561 1.0394 0.0556 5.1180 0.3840 3.2411 10.0094 0.5637 27.7850 5.8076 93.3932 107.5766 25.8691 38.8731 1.8736 10.3648 45.4075 0.0116 0.2513 406.2601 0.0017 9.1413 51.0216 2.4426 6.3533 0.0187 1.7300 1.1854 0.0466 3.4175 0.1053 34.4723 0.2249 6.1483 14.8967 0.6925 8.2637 111.1533 22.9314 0.5303 0.1853 1.4408 153.0101 21.4136 1.6718 3.4431 5.3824 5.4857 5.2004 0.6081 0.7988 37.1471 7.5196 36.1360 6.3124 183.1372 4.2472 17.7650 7.0826 8.8366 105.4171 20.3506 21.2706 8.7380 2.6777 0.4731 2.2169 7.8147 14.1867 11.3831 23.9414 33.1977 37.3171 27.5048 21.8208 6.6937 1.8155
temp: 298.150 k
press: 1.00000 atm
elementType: 8 7 6 6 6 6 6 6 6 6 6 6 6 6 6 6 6 6 6 6 6 1 1 1 1 1 1 1 1 1 1 1 1 1
symmnumber: 1
zpe: 685529.6 jmol-1
zpe.correction: 0.261104 hartree
zpe.thermalcorrener: 0.276863 hartree
zpe.thermalcorrenthalpy: 0.277808 hartree
zpe.thermalcorrgfe: 0.216478 hartree
zpe.sumelectzpe: -860.356361 hartree
zpe.sumelectthermal: -860.340602 hartree
zpe.sumelectthermalent: -860.339658 hartree
zpe.sumelectthermalfe: -860.400987 hartree
dipole: 1.0937 0.4608 0.0259
dipole: 1.1871
quadrupole: -97.5390 -101.2626 -130.2134
quadrupole: -0.3118 0.0446 -0.2641
quadrupole: 12.1327 8.4090 -20.5417 -0.3118 0.0446 -0.2641
hfenergy: -860.6174651 hartree
pointgroup: C01 [X(C19H13N1O1)]
dipole: -0.4184263 -0.2062224 0.0223844 debye
polarizability: 370.4260191|0.9649188|280.6720626|5.4543082|-19.4087286|81.330482 unknown
InChI: InChI=1S/C19H13NO/c1-2-8-14(9-3-1)21-20-19-17-12-6-4-10-15(17)16-11-5-7-13-18(16)19/h1-13H
charge 0 multiplicity 1
34 atoms
O  1.733794 -0.372799 0.048044
N  0.735083 0.680715 -0.073347
C  -2.85151 0.308142 -0.094957
C  -2.4638 -1.111135 0.061099
C  -1.658441 1.093561 -0.158315
C  -1.030571 -1.197662 0.09301
C  -0.488651 0.178863 -0.042507
C  -4.113024 0.926839 -0.181173
C  -3.251214 -2.271015 0.171353
C  -1.713091 2.490794 -0.307745
C  -0.390227 -2.446063 0.235475
C  -4.171188 2.335151 -0.331559
C  -2.604055 -3.524488 0.314571
C  -2.985017 3.109182 -0.394277
C  -1.191047 -3.610514 0.346373
C  3.066873 0.13042 0.035406
C  3.395306 1.500889 -0.042203
C  4.063467 -0.868006 0.114006
C  4.760257 1.866582 -0.03941
C  5.420717 -0.481796 0.115816
C  5.776308 0.885954 0.039318
H  -5.036141 0.338833 -0.134149
H  -4.344896 -2.214934 0.147987
H  -0.794027 3.082351 -0.355956
H  0.698797 -2.509209 0.259314
H  -5.144591 2.833339 -0.400674
H  -3.203351 -4.43764 0.401851
H  -3.054352 4.196115 -0.510954
H  -0.710919 -4.588732 0.458095
H  2.601552 2.247297 -0.102542
H  3.770702 -1.921115 0.171709
H  5.027824 2.927533 -0.098953
H  6.198275 -1.251082 0.176556
H  6.830455 1.182435 0.041039
