program: Gaussian 09
title: 000287116
version: EM64L-G09RevD.01
frameworkgroup: C1[X(C7H7N3O2)]
method: RPBEPBE
basis: SDD
operation: Freq
keyword: #pfreq=noraman
keyword: PBEPBE/SDD
title: #p freq=noraman PBEPBE/SDD
converged: YES YES NO NO
title: Mulliken charges:
elementType: O O N N N C C C C C C C H H H H H H H
charge: -0.196486 -0.226778 -0.442005 -0.097503 -0.649447 0.029002 -0.247800 0.224930 -0.178596 -0.160824 -0.356404 0.277132 0.286568 0.249579 0.342355 0.238655 0.248704 0.312192 0.346727
chargesum: 0.00000
title: Mulliken charges with hydrogens summed into heavy atoms:
elementType: O O N N N C C C C C C C
charge: -0.196486 -0.226778 -0.099649 -0.097503 0.009472 0.029002 0.038768 0.224930 0.070983 0.077831 -0.107701 0.277132
polarizability: 1.49096685e+02 9.63285992e-02 1.13466624e+02 -3.35133579e-02 1.59684432e-02 4.11591230e+01
1716.lowfreq: -10.4619 -10.1208 -0.0013 -0.0011 -0.0007 4.9827 17.9366 62.9172 103.3154
frequency: 17.4566 62.9124 103.3066 120.7565 184.6533 232.6473 295.9208 378.4669 381.6092 405.7267 438.8672 490.2311 533.2314 552.2763 617.3947 677.7110 701.3119 730.3039 757.0587 812.0651 840.2084 869.1626 894.6649 920.2895 973.4000 974.1421 1016.7965 1032.5100 1055.6549 1085.1031 1136.2485 1161.7210 1228.7246 1285.5702 1307.6285 1333.3312 1418.2430 1445.6138 1480.1874 1563.3756 1583.6415 1611.6954 1637.1059 1692.4710 3139.3930 3151.7917 3171.3122 3181.8796 3343.9119 3536.0355 3693.3661
redmass: 5.6304 5.2210 5.3204 5.6328 5.6733 9.3890 6.4624 5.1956 1.1679 3.1938 3.9491 7.9978 1.1392 4.0455 7.3525 4.4356 6.6912 6.9570 1.6818 2.0610 1.3224 6.4695 4.0215 1.3157 1.4433 7.0715 1.3447 2.2866 2.0932 1.6264 3.0326 1.0935 2.7684 1.5710 4.2825 5.3166 2.0799 2.1743 2.3606 6.1531 5.7180 1.2019 5.1267 7.1702 1.0884 1.0906 1.0952 1.1006 1.0770 1.0456 1.1043
irintensity: 9.7411 5.9619 11.6455 0.9171 0.3285 2.4469 1.4391 2.4166 99.3906 2.6460 0.6321 2.1736 212.1517 36.8589 5.2980 4.1854 1.3667 22.1869 69.0929 67.4826 74.1704 15.2303 1.0403 0.3554 0.6536 13.0754 0.5100 7.3588 8.7900 15.7150 13.5041 3.9722 89.5738 5.5126 142.0111 16.4973 54.7850 102.1205 1000.0190 12.8372 8.4683 34.2953 9.4812 410.6521 7.3380 12.4330 9.1707 15.2993 140.2155 43.7583 37.4369
temp: 298.150 k
press: 1.00000 atm
elementType: 8 8 7 7 7 6 6 6 6 6 6 6 1 1 1 1 1 1 1
symmnumber: 1
zpe: 366410.7 jmol-1
zpe.correction: 0.139558 hartree
zpe.thermalcorrener: 0.150119 hartree
zpe.thermalcorrenthalpy: 0.151063 hartree
zpe.thermalcorrgfe: 0.101534 hartree
zpe.sumelectzpe: -584.814644 hartree
zpe.sumelectthermal: -584.804083 hartree
zpe.sumelectthermalent: -584.803139 hartree
zpe.sumelectthermalfe: -584.852668 hartree
dipole: -4.9757 -5.9523 0.0227
dipole: 7.7581
quadrupole: -56.6063 -66.3904 -71.7678
quadrupole: -16.8562 0.0452 -0.0098
quadrupole: 8.3152 -1.4689 -6.8463 -16.8562 0.0452 -0.0098
hfenergy: -584.954202 hartree
pointgroup: C01 [X(C7H7N3O2)]
dipole: -2.0108028 -2.2963121 0.0064516 debye
dipolederiv: -0.6117236 -0.1024006 -0.0002584 0.1772074 -0.8796251 0.0009563 -0.0003882 -0.0008874 -0.3167168 -0.9412474 -0.2011294 0.0001306 -0.2553869 -0.7840653 0.0015213 0.0000162 0.0019851 -0.3585342 -2.1598956 0.5564085 -0.0024963 0.3650795 -0.7106213 0.0008071 -0.0026597 0.0009762 -0.3292678 -0.5006299 -0.0073413 -0.0002579 0.0329638 -0.3529412 -0.0003933 -0.0009863 -0.0006068 -0.2039915 -0.662406 0.4275323 -0.0017523 0.5231368 -1.0188631 0.0007865 -0.0020131 0.000481 -0.7788071 0.0064309 0.0687724 0.0000516 -0.1912167 0.0247197 0.0001368 -0.0000739 0.0001517 0.0203725 -0.3251465 0.004125 -0.0001219 0.0445661 0.0490113 0.0002657 0.0004299 0.0002199 -0.0612208 1.5953324 -0.1742673 0.0014099 -0.620886 1.2721537 -0.0015505 0.0016655 0.0001285 0.2313089 0.2139965 -0.0906029 -0.0001931 -0.0568196 0.124665 0.000595 -0.0001616 0.0005705 -0.1143188 0.0469144 0.1564068 0.0002789 -0.0592591 -0.2121769 -0.0003682 -0.0000838 -0.0002155 -0.1009078 -0.0368351 -0.1040535 -0.0003983 0.1897169 0.3801259 0.0011851 0.000428 0.0011249 -0.0708136 2.4030055 -0.4280356 0.0030809 -0.1156952 1.595696 -0.004898 0.003547 -0.005313 0.3604243 0.1566586 -0.0424517 -0.0000762 -0.0093328 0.020249 -0.0003726 -0.0000873 -0.0003269 0.1631036 -0.0260688 0.0846889 0.0001805 0.0923547 0.0298522 -0.0002874 0.0002286 -0.0003157 0.1492454 0.4838401 0.0323081 0.0004618 0.1057924 0.1542196 0.000421 0.0003366 0.0006734 0.2986124 -0.072965 -0.0712659 -0.0001701 -0.0629405 0.075688 -0.0002019 -0.0001409 -0.0002064 0.1642356 0.0612473 -0.0240043 -0.0000888 -0.0708571 -0.0956012 -0.0005876 -0.0002163 -0.0005324 0.1394123 0.1646642 -0.0510543 0.0002276 -0.0780122 0.1444456 0.0011118 0.000235 0.0013344 0.40669 0.2048281 -0.033635 -0.0000084 -0.0104117 0.1830681 0.000873 -0.0000757 0.0007586 0.4011735 unknown
polarizability: 149.0823133|-0.7206498|113.4809374|0.0819653|0.0266606|41.1591815 unknown
InChI: InChI=1S/C7H7N3O2/c8-7(12)10-6(11)5-3-1-2-4-9-5/h1-4,10H,8H2
charge 0 multiplicity 1
19 atoms
O  0.904987 1.977667 0.001423
O  3.622221 0.734129 0.000617
N  1.494716 -0.331381 0.001908
N  -1.038714 -1.079022 -0.004318
N  3.463304 -1.589347 0.008489
C  -0.830105 0.275918 -0.000999
C  -1.88232 1.217441 0.001191
C  0.614614 0.754248 -0.000239
C  -3.210693 0.739054 0.000179
C  -3.437477 -0.65734 -0.003015
C  -2.323058 -1.528907 -0.005233
C  2.917945 -0.304567 0.003776
H  -1.633284 2.282334 0.003653
H  -4.052577 1.438737 0.001844
H  0.981735 -1.229903 0.002208
H  -4.451844 -1.067325 -0.003873
H  -2.457032 -2.615941 -0.007812
H  2.91198 -2.445159 0.012423
H  4.4785 -1.65384 0.009276
