program: Gaussian 09
title: 000287126
version: EM64L-G09RevD.01
frameworkgroup: C1[X(C16H17NO)]
method: RPBEPBE
basis: SDD
operation: Freq
keyword: #p
keyword: freq=noraman
keyword: PBEPBE/SDD
title: #p freq=noraman PBEPBE/SDD
converged: YES YES NO NO
title: Mulliken charges:
elementType: O N C C C C C C C C C C C C C C C C H H H H H H H H H H H H H H H H H
charge: -0.263761 -0.043932 0.324048 0.328769 -0.042964 -0.375025 -0.376432 -0.386732 -0.345683 0.435832 0.434852 -0.404289 -0.393777 -0.378210 -0.401656 -0.808971 -0.807164 -0.487982 0.255576 0.258242 0.258820 0.258405 0.229883 0.230411 0.228122 0.228896 0.225696 0.224427 0.236458 0.235586 0.225852 0.226433 0.225459 0.224059 0.220751
chargesum: 0.00000
title: Mulliken charges with hydrogens summed into heavy atoms:
elementType: O N C C C C C C C C C C C C C C C C
charge: -0.263761 -0.043932 0.324048 0.328769 -0.042964 -0.119449 -0.118190 -0.127912 -0.087278 0.435832 0.434852 -0.174406 -0.163365 -0.150087 -0.172760 -0.122390 -0.119294 0.182288
polarizability: 2.65741811e+02 -3.94493422e+00 2.15648976e+02 1.36021815e+01 3.07069146e-01 1.13019081e+02
1716.lowfreq: -23.0130 -1.2751 -0.0006 -0.0005 -0.0004 2.6022 8.3069 21.0730 34.3343
frequency: -22.5148 20.5715 34.3039 53.9911 58.5611 67.5774 88.6547 115.7037 148.7287 154.5917 189.3874 231.7646 262.9408 278.1600 305.4242 333.7131 349.4053 359.7925 377.6053 402.7820 411.5619 476.4620 501.9009 537.3096 583.3680 626.5498 635.6056 657.5976 689.3839 728.5073 733.1028 778.8171 800.9504 823.4594 833.6423 843.2521 851.8072 854.5610 943.7298 963.8486 966.1066 977.1503 981.1069 986.2698 988.5098 997.2942 1014.4334 1018.1899 1046.1718 1046.4515 1111.3197 1125.2506 1127.5675 1146.3432 1169.3466 1194.7278 1200.5592 1224.8416 1226.5498 1296.8310 1308.9268 1319.3395 1360.3096 1365.3292 1397.3929 1397.5670 1405.7777 1408.0137 1418.7143 1446.4531 1468.7965 1469.6464 1473.1680 1473.5301 1474.2782 1494.5865 1503.5628 1522.7148 1570.3341 1577.1221 1619.4918 1621.5813 2973.5158 2973.9979 2979.0378 3054.2794 3055.1262 3078.8753 3084.3432 3085.1667 3115.8700 3120.2556 3120.5495 3122.7295 3124.7661 3150.0177 3153.1104 3163.6130 3179.0080
redmass: 1.0134 1.0275 3.7297 3.7835 3.7085 3.6826 2.2072 2.7835 3.6359 2.1253 2.7916 4.5423 4.7375 4.1084 4.4469 4.2231 4.1687 3.3251 3.2399 2.8543 2.9121 3.2159 3.2014 4.3140 4.8444 5.9062 6.7794 4.8863 4.9451 3.2429 2.8665 4.7043 5.1510 1.9732 1.6613 2.0655 1.5640 1.2559 3.2520 1.3193 1.6770 1.3973 1.3728 1.5573 1.4302 4.8009 3.0245 2.6526 1.5667 1.5654 1.2527 1.3192 1.3374 1.6954 2.9140 1.1172 1.1471 2.8575 2.8050 2.4052 1.3236 1.6411 4.8999 5.3402 1.2250 1.2250 3.5253 3.1985 1.1563 1.0537 1.1311 1.0960 1.0638 1.0544 1.0548 3.0097 2.7723 4.7481 5.8091 6.4247 6.2723 6.3824 1.0388 1.0389 1.0291 1.0948 1.0945 1.1050 1.0997 1.0998 1.1026 1.0888 1.0885 1.0887 1.0899 1.0957 1.0947 1.0950 1.0946
irintensity: 0.5094 0.5686 0.0453 1.2785 2.5037 0.1069 1.8916 0.3040 0.1146 0.7558 3.5497 0.2262 1.0662 2.8619 1.4852 11.7295 2.8162 0.1854 1.0348 0.1509 0.1340 17.0620 13.3953 21.6296 4.4211 5.6917 0.0537 10.8172 6.0675 3.7219 12.8546 12.1681 5.6913 87.4566 50.6447 13.8783 7.2363 0.8038 71.3564 0.9009 38.6695 3.0070 0.3899 15.4684 7.6489 98.2224 2.5931 6.5586 17.0711 22.6727 0.1920 10.2711 3.5460 13.7419 2.5418 15.6979 2.7104 0.3399 0.2299 28.7191 2.7815 18.0861 2.1372 6.2566 11.1339 7.7225 3.8614 5.2347 1.6048 10.9840 13.4043 19.3195 12.3169 13.0624 22.2873 31.2327 19.5570 0.8384 1.0461 1.3347 25.7800 6.2807 48.4156 37.7111 109.1922 22.8805 23.3240 43.9937 17.9949 17.6326 19.3457 9.9729 22.1527 29.9281 22.9986 13.6526 14.5731 3.8580 4.2055
temp: 298.150 k
press: 1.00000 atm
elementType: 8 7 6 6 6 6 6 6 6 6 6 6 6 6 6 6 6 6 1 1 1 1 1 1 1 1 1 1 1 1 1 1 1 1 1
symmnumber: 1
zpe: 745183.8 jmol-1
zpe.correction: 0.283826 hartree
zpe.thermalcorrener: 0.300902 hartree
zpe.thermalcorrenthalpy: 0.301846 hartree
zpe.thermalcorrgfe: 0.236925 hartree
zpe.sumelectzpe: -748.539962 hartree
zpe.sumelectthermal: -748.522886 hartree
zpe.sumelectthermalent: -748.521942 hartree
zpe.sumelectthermalfe: -748.586862 hartree
dipole: -0.1995 -0.7829 -0.0090
dipole: 0.8080
quadrupole: -90.1268 -91.7364 -107.0113
quadrupole: -0.5323 3.5452 0.3297
quadrupole: 6.1647 4.5551 -10.7198 -0.5323 3.5452 0.3297
hfenergy: -748.8237879 hartree
pointgroup: C01 [X(C16H17N1O1)]
dipole: -0.0670334 -0.3078173 0.0424479 debye
polarizability: 264.3372875|1.1490517|213.1331933|20.823748|-15.0528793|116.9393866 unknown
InChI: InChI=1S/C16H17NO/c1-12-4-8-14(9-5-12)16(17-18-3)15-10-6-13(2)7-11-15/h4-11H,1-3H3
charge 0 multiplicity 1
35 atoms
O  -1.3619 2.801123 -0.515601
N  -0.024495 2.220432 -0.417521
C  1.320776 0.313491 -0.035913
C  -1.252233 0.037446 -0.088127
C  -0.042675 0.908482 -0.196235
C  1.583808 -1.029619 -0.418123
C  -1.302471 -0.97566 0.909442
C  2.399118 1.089121 0.473742
C  -2.374286 0.183269 -0.94879
C  3.957556 -0.803189 0.209476
C  -3.547301 -1.673669 0.174431
C  2.88003 -1.574035 -0.295697
C  -2.433487 -1.806467 1.043277
C  3.688853 0.537907 0.594061
C  -3.492613 -0.664932 -0.82229
C  5.356898 -1.382433 0.318269
C  -4.747171 -2.596294 0.293484
C  -1.196785 4.253605 -0.681649
H  0.773603 -1.645754 -0.82194
H  -0.454699 -1.099815 1.591979
H  2.204915 2.122638 0.776132
H  -2.366414 0.964671 -1.712387
H  3.058144 -2.612547 -0.600664
H  -2.452708 -2.56888 1.831654
H  4.502288 1.152611 0.999386
H  -4.343204 -0.537517 -1.503115
H  5.886411 -0.998774 1.208699
H  5.336732 -2.484549 0.380261
H  5.967808 -1.112837 -0.565602
H  -4.611447 -3.505939 -0.324049
H  -4.901046 -2.928469 1.335419
H  -5.67379 -2.103427 -0.049809
H  -0.633049 4.481561 -1.603936
H  -0.676204 4.690719 0.189246
H  -2.224259 4.646728 -0.750211
