program: Gaussian 09
title: 000287287
version: EM64L-G09RevD.01
frameworkgroup: C1[X(C20H28N2O4S)]
method: RPBEPBE
basis: SDD
operation: Freq
keyword: #p
keyword: freq=noraman
keyword: PBEPBE/SDD
title: #p freq=noraman PBEPBE/SDD
converged: YES YES NO NO
title: Mulliken charges:
elementType: S O O O O N N C C C C C C C C C C C C C C C C C C C C H H H H H H H H H H H H H H H H H H H H H H H H H H H H
charge: 0.904925 -0.456045 -0.559044 -0.533442 -0.269121 -0.101395 -0.457937 -0.402772 -0.423561 -0.370242 -0.546078 -0.420273 0.530768 -0.317835 -0.005210 -0.469271 -0.383641 -0.263517 -0.225644 -0.350607 -0.374206 0.315306 0.454047 -0.330870 -0.394070 -0.799030 -0.538790 0.209415 0.236014 0.224001 0.262057 0.218178 0.230145 0.254322 0.277157 0.208949 0.203209 0.299538 0.186012 0.204185 0.226604 0.286342 0.287056 0.276437 0.234572 0.247573 0.344968 0.243465 0.244659 0.239067 0.229366 0.236798 0.241591 0.217259 0.218618
chargesum: 0.00000
title: Mulliken charges with hydrogens summed into heavy atoms:
elementType: S O O O O N N C C C C C C C C C C C C C C C C C C C C
charge: 0.904925 -0.111077 -0.559044 -0.533442 -0.269121 -0.101395 -0.158399 0.042657 0.062497 0.078081 -0.133920 0.111205 0.530768 0.072361 -0.005210 -0.242667 -0.097299 0.023539 0.050794 -0.116035 -0.126633 0.315306 0.454047 -0.087405 -0.149410 -0.093799 0.138677
polarizability: 3.47221131e+02 -1.70072779e+01 3.03850591e+02 5.84004709e+00 4.28546571e+00 1.96654298e+02
1716.lowfreq: -41.4701 -5.6641 -2.2658 -0.0007 -0.0005 0.0004 3.5229 12.1226 14.9812
frequency: -41.4513 12.0029 14.9254 21.7784 24.7424 29.1129 35.2889 40.2413 48.9734 51.4503 66.1127 83.0254 86.3835 102.1882 129.2735 139.1749 150.2776 176.2977 207.5383 210.3480 224.2754 230.1931 236.8379 245.8345 255.7928 262.7039 282.9243 305.3071 319.9252 328.4001 339.8305 350.6507 369.5205 384.7143 393.9750 407.0344 416.7026 419.0482 425.6054 465.9096 483.1245 513.5419 517.1919 544.6051 560.0672 594.5323 621.9951 633.0740 709.5481 712.1302 732.2857 741.9684 774.9298 782.3337 798.6163 805.4643 805.6748 808.5823 824.5557 828.1557 842.6464 849.7609 864.6520 923.6316 930.8099 962.8008 970.5646 980.5809 983.1130 987.4314 989.8969 996.5929 997.7229 1000.6393 1005.3694 1016.7691 1032.2225 1033.3748 1049.7452 1053.7519 1055.7343 1069.3620 1111.3020 1112.0358 1118.5534 1139.4523 1147.4709 1157.9811 1180.3267 1183.1400 1184.7063 1206.9468 1213.3670 1217.6303 1227.1251 1251.1651 1251.6178 1265.8663 1282.1448 1286.9807 1296.3273 1301.2937 1314.3321 1322.8570 1352.7063 1363.3602 1377.6647 1381.1067 1381.5235 1391.7719 1393.5184 1400.8606 1407.4768 1418.0033 1429.5227 1435.0303 1464.8139 1465.4004 1467.0669 1469.9494 1472.1706 1473.3582 1474.3718 1475.1977 1481.4358 1484.6509 1503.8642 1583.4566 1595.6672 1597.5157 1623.9105 2877.9087 2917.6316 2935.9121 2936.7386 2953.3676 2980.4498 2983.0911 2999.2995 3002.1776 3014.4569 3025.6546 3038.4849 3047.6121 3055.3674 3062.6140 3071.2920 3092.0538 3112.5909 3115.8629 3120.3111 3134.4714 3140.6108 3157.1446 3160.9693 3161.7166 3167.4465 3335.2790 3575.8100
redmass: 1.0288 5.3144 5.3020 5.7439 3.9071 4.4889 3.9006 4.6181 4.6206 4.1732 4.9060 3.0831 3.0594 3.5744 4.9958 3.8662 3.2722 3.4673 4.1754 2.9453 5.8850 2.6580 3.6829 1.3932 1.1169 2.9566 5.7142 4.1324 2.9740 3.7351 3.7995 4.4707 3.3979 4.0508 4.3053 2.8633 4.3048 3.6572 4.0368 4.0864 3.6530 3.2861 3.0020 3.7353 3.4248 5.6366 6.9606 6.7716 3.2681 3.7327 2.2913 1.5606 5.1452 1.2461 10.3042 1.6141 1.6228 1.5567 2.1921 1.3613 1.6045 1.2523 2.9053 10.3455 1.3955 1.3128 7.1162 1.4204 1.3868 1.7139 6.2567 3.1369 2.3179 2.7839 2.7711 2.9225 2.2073 2.9865 1.5866 2.4792 2.5006 2.0099 1.4775 1.2648 1.2817 1.4508 1.4695 1.3328 1.2925 1.1364 1.1387 1.2816 2.1011 3.0205 3.2389 1.5790 1.5097 1.2114 1.3817 1.1879 1.2631 1.2268 1.2975 1.4631 1.3383 1.2604 1.3670 4.4578 3.5385 2.9088 1.3041 1.3356 1.4422 3.0628 1.0620 1.1705 1.0509 1.0801 1.0853 1.0450 1.1015 2.3279 1.0804 1.1118 1.0838 1.0853 2.4024 6.7657 6.5664 6.3713 6.3608 1.0695 1.0689 1.0648 1.0604 1.0331 1.0599 1.0375 1.0998 1.0670 1.0875 1.0959 1.1036 1.1004 1.0960 1.0975 1.1001 1.0991 1.0910 1.0895 1.0987 1.0891 1.0893 1.0934 1.0957 1.0945 1.0965 1.0742 1.0667
irintensity: 0.5121 1.2306 0.1206 1.7133 0.6932 0.7965 0.6108 0.6013 1.7351 1.1374 0.6435 2.4202 11.1307 4.3710 1.5928 1.2294 1.2020 1.4079 1.3194 5.2061 8.0802 10.6940 12.8358 0.8208 140.2239 17.6995 7.2008 1.9182 7.3476 10.1764 9.4410 8.3033 14.5251 14.7728 7.5801 0.1199 22.9615 10.3878 7.6434 33.0589 7.0907 63.4111 20.7436 26.4948 13.7555 43.9347 0.3019 0.6550 0.7976 3.8233 6.9041 58.7931 23.4640 9.7195 93.3811 39.0530 43.9701 23.7440 41.1623 37.7556 23.2235 3.9788 33.1593 62.0899 0.6020 0.9466 121.1931 3.0973 0.2633 2.2446 41.8143 8.4718 33.6411 13.3544 6.7477 15.2576 7.1566 6.3187 13.5383 27.3269 31.8638 34.2238 1.6628 0.2674 10.3854 67.3614 29.3347 3.0112 64.7705 7.9287 7.0860 46.1981 2.3142 6.0927 162.8230 5.0014 17.7761 8.0709 5.4621 7.8246 3.2545 12.0964 0.0631 25.4284 0.3594 5.3611 7.8842 8.5156 3.6330 10.4330 0.7531 14.4690 0.5208 2.2377 12.8400 8.4751 12.1307 2.5123 12.5182 14.0570 8.4228 27.3526 61.0320 16.2686 7.4885 8.5083 131.5430 8.8084 3.7878 4.4792 40.1791 65.3662 59.6437 9.9033 117.1851 81.8259 46.5665 26.3482 38.1979 24.2848 35.3722 12.0064 53.3562 23.4264 56.9153 15.6831 5.8120 16.2115 1.1015 27.0275 20.5057 12.0881 8.9838 20.5161 5.0645 5.6576 7.1432 9.7206 3.8121
temp: 298.150 k
press: 1.00000 atm
elementType: 16 8 8 8 8 7 7 6 6 6 6 6 6 6 6 6 6 6 6 6 6 6 6 6 6 6 6 1 1 1 1 1 1 1 1 1 1 1 1 1 1 1 1 1 1 1 1 1 1 1 1 1 1 1 1
symmnumber: 1
zpe: 1172329.5 jmol-1
zpe.correction: 0.446517 hartree
zpe.thermalcorrener: 0.475671 hartree
zpe.thermalcorrenthalpy: 0.476615 hartree
zpe.thermalcorrgfe: 0.380820 hartree
zpe.sumelectzpe: -1585.110895 hartree
zpe.sumelectthermal: -1585.081741 hartree
zpe.sumelectthermalent: -1585.080796 hartree
zpe.sumelectthermalfe: -1585.176592 hartree
dipole: 3.6744 0.6635 -3.9851
dipole: 5.4610
quadrupole: -119.7665 -156.9882 -175.6079
quadrupole: 2.0122 -1.2136 -5.9743
quadrupole: 31.0210 -6.2007 -24.8204 2.0122 -1.2136 -5.9743
hfenergy: -1585.5574118 hartree
pointgroup: C01 [X(C20H28N2O4S1)]
dipole: 1.3013166 -0.0472417 -1.7089502 debye
polarizability: 335.3111713|-24.9894812|314.8970364|-8.2453495|11.227534|197.5178126 unknown
InChI: InChI=1S/C20H28N2O4S/c1-17-3-9-20(10-4-17)27(24,25)21-12-14-22(15-16-23)13-11-18-5-7-19(26-2)8-6-18/h3-10,21,23H,11-16H2,1-2H3
charge 0 multiplicity 1
55 atoms
S  2.33229 -0.099152 0.515801
O  -1.531693 6.836485 -0.072819
O  0.810349 -0.608401 0.202331
O  2.859183 0.160242 2.040083
O  -5.343752 -3.320242 0.649723
N  -0.774749 3.189791 0.248233
N  2.564016 1.483314 -0.513919
C  0.664255 2.949962 0.441422
C  -1.643935 2.03802 0.586354
C  -1.278084 4.532747 0.591017
C  -2.562423 1.591145 -0.586067
C  1.257827 2.157711 -0.757774
C  -3.330804 0.316103 -0.266629
C  -1.050709 5.530093 -0.556094
C  3.525317 -1.297625 -0.30306
C  -4.742057 0.302067 -0.185115
C  -2.635911 -0.905003 -0.027591
C  4.776459 -1.491432 0.304123
C  3.113437 -1.971552 -1.462061
C  -5.460688 -0.879973 0.117158
C  -3.331731 -2.088955 0.272672
C  -4.747948 -2.081092 0.345403
C  5.30319 -3.111227 -1.4814
C  5.663145 -2.407697 -0.300231
C  4.020475 -2.884301 -2.04586
C  6.271111 -4.094438 -2.113652
C  -6.802809 -3.355971 0.743984
H  1.187202 3.921046 0.542156
H  0.868748 2.377184 1.379189
H  -2.272815 2.259906 1.476274
H  -0.999404 1.182663 0.861887
H  -0.812617 4.945914 1.515199
H  -2.364475 4.469947 0.781608
H  1.406136 2.81734 -1.63419
H  0.542638 1.373623 -1.062928
H  -1.914174 1.44418 -1.472257
H  -3.263622 2.410165 -0.8379
H  3.207555 2.050957 0.075684
H  0.030283 5.577321 -0.813264
H  -1.610288 5.191825 -1.452596
H  -5.298469 1.231144 -0.362587
H  -1.538963 -0.928203 -0.071514
H  5.030955 -0.963059 1.228663
H  2.11642 -1.806391 -1.881852
H  -6.553422 -0.849315 0.168509
H  -2.802465 -3.029074 0.457041
H  -1.446318 7.508749 -0.793847
H  6.645594 -2.581678 0.153905
H  3.724431 -3.427258 -2.950312
H  6.524715 -4.91068 -1.411889
H  5.850401 -4.551929 -3.024684
H  7.219887 -3.598499 -2.390731
H  -7.051064 -4.399582 0.988331
H  -7.277863 -3.075243 -0.216981
H  -7.173171 -2.687373 1.546253
