program: Gaussian 09
title: 000287136
version: EM64L-G09RevD.01
frameworkgroup: C1[X(C14H27O5P)]
method: RPBEPBE
basis: SDD
operation: Freq
keyword: #p
keyword: freq=noraman
keyword: PBEPBE/SDD
title: #p freq=noraman PBEPBE/SDD
converged: YES YES NO NO
title: Mulliken charges:
elementType: P O O O O O C C C C C C C C C C C C C C H H H H H H H H H H H H H H H H H H H H H H H H H H H
charge: 1.302660 -0.549946 -0.517737 -0.293589 -0.623187 -0.217650 -0.254614 0.380186 -0.183843 -0.228122 -0.217723 -0.369799 -0.368891 0.287171 -0.768966 -0.803591 -0.689572 -0.686872 -0.679345 -0.671551 0.243759 0.233760 0.232921 0.220862 0.217776 0.212374 0.215141 0.192188 0.217347 0.220401 0.220310 0.237686 0.243679 0.221604 0.224893 0.247572 0.228655 0.244291 0.306038 0.226499 0.231804 0.214874 0.214687 0.222981 0.251990 0.199803 0.211090
chargesum: 0.00000
title: Mulliken charges with hydrogens summed into heavy atoms:
elementType: P O O O O O C C C C C C C C C C C C C C
charge: 1.302660 -0.549946 -0.517737 -0.293589 -0.623187 -0.217650 -0.254614 0.380186 0.059916 0.238558 0.220914 0.057715 0.040643 0.287171 -0.048448 -0.039250 -0.011175 0.003304 -0.026804 -0.008669
polarizability: 1.95894822e+02 5.42059335e+00 2.10890448e+02 1.35758847e+00 1.41349018e+01 1.88439534e+02
1716.lowfreq: -14.2237 -8.8257 -6.4416 -0.0011 -0.0010 0.0003 9.2902 14.1352 17.4678
frequency: -3.6085 13.5337 16.5226 25.1488 29.9993 51.1137 54.4920 64.9210 65.8470 90.3898 94.4763 99.7843 124.7992 136.6127 143.7126 160.4416 164.3785 175.4962 184.4916 203.9917 206.0251 223.9223 224.8476 229.6912 248.0564 261.4747 273.9710 281.4211 296.5980 318.4461 335.3291 361.1064 384.2458 393.3104 416.4614 442.6161 457.0058 490.9718 532.0799 618.1365 645.1395 675.1597 689.1324 705.7386 765.2056 782.2966 787.4500 871.5779 882.7527 886.0358 888.1191 894.2776 904.2057 928.0743 930.7453 948.7533 962.3212 965.6700 970.7523 1012.5039 1031.8884 1039.8605 1046.8180 1063.0475 1084.2683 1099.4628 1100.3721 1107.7949 1109.8982 1128.9947 1136.4194 1145.6657 1175.3282 1222.7794 1231.0775 1255.4296 1267.0588 1280.9384 1297.8459 1303.1499 1338.1282 1346.8986 1352.9966 1369.1860 1377.3089 1382.2148 1388.7380 1393.3736 1395.7741 1402.9929 1451.3593 1453.1670 1460.5656 1462.4844 1470.2615 1471.5514 1472.1777 1473.8423 1477.2446 1478.7367 1482.3526 1485.3146 1486.1193 1489.6381 1490.2184 1492.1891 1656.4726 1670.1304 2970.1410 2977.8314 2979.5464 2980.8147 2983.2674 2986.2163 2986.6794 2988.6130 2991.2671 3001.2240 3033.2476 3037.9792 3040.7894 3047.6211 3059.1441 3060.0752 3061.9101 3077.1808 3081.9283 3083.7188 3084.7574 3087.9840 3094.7940 3098.5258 3099.6069 3099.6686 3112.4544
redmass: 3.2576 2.7641 3.3511 3.2476 3.5902 2.9897 3.1862 3.2104 1.7169 4.1039 2.5742 1.5215 2.5643 3.2780 3.2375 1.5345 2.1978 2.8629 2.6391 1.1549 1.9362 1.2101 2.0959 2.2693 2.3656 2.4570 2.7100 2.8306 3.5545 3.7574 3.9776 4.2850 3.0292 2.9435 3.4772 3.9081 4.8120 4.6647 5.3145 4.5117 4.3649 5.8076 5.4756 6.1242 1.0781 1.5590 4.7088 2.8196 3.0631 1.2053 1.9377 2.9090 1.5982 2.1432 1.2123 4.6370 1.3548 1.4506 1.3251 6.9490 4.6523 11.1099 2.8903 1.8204 1.6559 1.7103 2.1349 2.2162 1.7798 2.1679 1.6643 1.4662 1.8468 1.2133 1.2559 4.8835 1.1896 1.1012 1.3267 1.3275 1.6137 1.3245 1.4008 1.3678 1.1912 1.2117 1.2162 1.2053 1.2010 1.1850 1.0643 1.0791 1.0652 1.0461 1.0535 1.0631 1.0573 1.0600 1.0476 1.0417 1.0750 1.0722 1.0507 1.0569 1.0643 1.0757 6.3313 9.9647 1.0375 1.0569 1.0361 1.0380 1.0395 1.0561 1.0342 1.0353 1.0587 1.0590 1.0853 1.0996 1.1028 1.0964 1.0963 1.1066 1.1058 1.0999 1.0993 1.1039 1.1003 1.1011 1.1007 1.0997 1.0999 1.1006 1.0984
irintensity: 1.8842 0.1780 0.5289 1.6947 0.3904 0.4181 1.3345 2.2354 1.0932 1.0709 0.5840 0.1038 1.7579 1.5999 1.2644 0.7412 0.5999 5.7691 1.3861 1.1596 1.8266 1.4394 2.1893 1.8727 9.0855 5.0040 8.6499 9.9171 5.3504 4.6651 3.3900 5.3747 6.4410 3.7870 5.6656 40.9508 23.5619 53.1917 6.8525 6.8751 71.0514 31.5591 80.3898 42.2377 6.3924 34.3112 6.5907 14.2885 8.4121 4.3850 30.5887 2.2846 50.1841 175.6045 30.4695 125.6237 18.1001 1.0847 0.5809 153.1707 284.3378 208.4878 11.2811 28.5860 4.2953 14.9041 2.6221 2.0476 26.6970 2.0720 0.3419 0.2237 0.4162 0.4249 0.2290 5.0714 4.6502 0.3822 3.2690 0.8288 23.5601 2.0609 1.2809 1.4216 12.6011 18.4255 21.9316 10.6894 30.9513 34.2136 14.8160 7.8109 7.8991 8.5099 4.9593 7.5841 8.4948 6.3360 6.5502 12.1913 0.6053 14.6740 30.8726 14.0189 7.6279 37.8115 39.0455 108.8561 32.2434 15.4059 29.7072 30.9722 37.1612 24.7746 23.3619 27.1449 45.0690 34.6611 4.6737 10.5552 0.0270 10.5612 17.7304 25.5495 0.7723 66.7780 38.4842 84.8386 28.0643 8.9033 28.1186 36.4999 32.9410 0.5111 14.9766
temp: 298.150 k
press: 1.00000 atm
elementType: 15 8 8 8 8 8 6 6 6 6 6 6 6 6 6 6 6 6 6 6 1 1 1 1 1 1 1 1 1 1 1 1 1 1 1 1 1 1 1 1 1 1 1 1 1 1 1
symmnumber: 1
zpe: 1028180.2 jmol-1
zpe.correction: 0.391613 hartree
zpe.thermalcorrener: 0.418070 hartree
zpe.thermalcorrenthalpy: 0.419014 hartree
zpe.thermalcorrgfe: 0.331693 hartree
zpe.sumelectzpe: -1265.384435 hartree
zpe.sumelectthermal: -1265.357978 hartree
zpe.sumelectthermalent: -1265.357034 hartree
zpe.sumelectthermalfe: -1265.444356 hartree
dipole: -3.3320 0.5368 3.5936
dipole: 4.9300
quadrupole: -134.7079 -117.3030 -127.8658
quadrupole: 7.4090 3.6962 0.2049
quadrupole: -8.0823 9.3226 -1.2403 7.4090 3.6962 0.2049
hfenergy: -1265.7760484 hartree
pointgroup: C01 [X(C14H27O5P1)]
dipole: 1.4779331 -0.5746254 1.1169352 debye
polarizability: 197.1361791|5.6745765|207.7972079|-6.746263|-14.3607295|190.2914165 unknown
InChI: InChI=1S/C14H27O5P/c1-7-9-17-20(16,18-10-8-2)14(12(5)6)19-13(15)11(3)4/h11H,7-10H2,1-6H3
charge 0 multiplicity 1
47 atoms
P  -1.276362 1.023498 -0.488189
O  -1.219375 -0.709398 -0.283945
O  -2.046401 1.496347 0.981022
O  1.171649 0.788631 0.703476
O  -2.061074 1.540358 -1.772783
O  1.969677 -0.808439 -0.825271
C  0.512619 1.525695 -0.344349
C  1.157223 2.500584 -1.043612
C  2.305445 -1.149514 1.608055
C  -1.200154 -1.553919 -1.516854
C  -1.832327 0.765422 2.265478
C  -1.656022 -2.955579 -1.106183
C  -2.874245 1.306906 3.248119
C  1.833107 -0.431302 0.352246
C  2.629293 2.778213 -0.802949
C  0.485519 3.362383 -2.092709
C  3.765029 -1.631666 1.433065
C  1.34388 -2.340467 1.885466
C  -1.6380 -3.924081 -2.31093
C  -4.324614 0.995519 2.824946
H  2.23876 -0.435354 2.448009
H  -0.165414 -1.563682 -1.909399
H  -1.880481 -1.111592 -2.269805
H  -0.800535 0.960216 2.61602
H  -1.964353 -0.318063 2.085425
H  -0.989433 -3.331027 -0.306939
H  -2.67436 -2.892668 -0.679498
H  -2.658421 0.862653 4.241649
H  -2.732691 2.3999 3.345803
H  4.082179 -2.201468 2.324543
H  4.461257 -0.783989 1.30096
H  3.850765 -2.28664 0.548587
H  0.295249 -2.003928 1.959846
H  1.628392 -2.832259 2.832664
H  1.410829 -3.084293 1.071337
H  3.005568 2.299636 0.114174
H  2.803074 3.868032 -0.735863
H  3.223463 2.405873 -1.659931
H  -0.546902 3.050525 -2.314961
H  1.076331 3.331031 -3.028268
H  0.476755 4.417585 -1.756583
H  -2.317216 -3.579144 -3.11263
H  -0.622848 -4.010601 -2.741189
H  -1.963087 -4.934647 -2.005861
H  -4.528327 1.41768 1.82645
H  -4.500192 -0.095933 2.776996
H  -5.048133 1.425764 3.540764
