program: Gaussian 09
title: 000287113
version: EM64L-G09RevD.01
frameworkgroup: C1[X(C16H13N9)]
method: RPBEPBE
basis: SDD
operation: Freq
keyword: #pfreq=noraman
keyword: PBEPBE/SDD
title: #p freq=noraman PBEPBE/SDD
converged: YES YES NO NO
title: Mulliken charges:
elementType: N N N N N N N N N C C C C C C C C C C C C C C C C H H H H H H H H H H H H H
charge: -0.396501 -0.130668 -0.129617 -0.011251 -0.116652 -0.140591 -0.581615 -0.581488 -0.029505 0.317044 0.489365 -0.337041 -0.337229 -0.428118 -0.377624 0.035012 0.019222 0.023874 0.023875 0.286943 -0.289150 -0.352472 -0.203838 -0.231724 -0.219258 0.278132 0.277747 0.228970 0.261504 0.321742 0.265903 0.259021 0.233848 0.238778 0.333308 0.333447 0.333221 0.333385
chargesum: 0.00000
title: Mulliken charges with hydrogens summed into heavy atoms:
elementType: N N N N N N N N N C C C C C C C C C C C C C C C C
charge: -0.074759 -0.130668 -0.129617 -0.011251 -0.116652 -0.140591 0.085140 0.085118 -0.029505 0.317044 0.489365 -0.058909 -0.059482 -0.199148 -0.116120 0.035012 0.019222 0.023874 0.023875 0.286943 -0.023247 -0.093452 0.030011 0.007054 -0.219258
polarizability: 6.27649060e+02 1.70376207e+01 2.82304537e+02 5.27685637e-01 -2.27056963e-02 9.05949274e+01
1716.lowfreq: -5.1208 -3.6060 -0.0005 0.0005 0.0008 1.9408 12.5541 21.4406 30.9087
frequency: 11.6145 21.4346 30.8974 51.5811 65.0285 82.2491 110.5179 111.2482 139.7407 183.7766 184.2494 190.6290 196.1606 196.6658 202.3641 294.8402 303.8217 325.8900 345.7560 353.4459 383.7956 387.4874 413.0283 477.0930 481.5653 490.3358 502.3018 514.7592 518.5772 521.6439 548.5906 549.0759 565.2196 568.1270 579.9958 599.5646 622.4345 643.4722 669.1585 680.2769 715.4663 747.2191 753.2128 754.8612 762.0338 777.2413 809.1083 813.0704 842.1062 866.8866 868.1707 892.8854 907.4140 917.9543 968.4889 985.2701 989.8995 990.0220 997.8654 1003.9382 1006.8098 1034.4712 1090.6596 1110.2541 1128.3622 1161.2711 1167.2187 1172.4017 1185.3662 1192.5080 1218.5687 1252.6702 1265.1588 1275.5084 1301.7073 1343.8934 1373.0203 1378.7577 1380.9562 1411.6351 1427.5173 1431.5908 1468.2878 1472.3955 1485.5020 1509.0512 1518.1303 1527.1585 1572.5355 1587.5913 1594.7364 1597.3882 1616.2986 1629.1977 2179.6121 3127.7538 3138.5494 3153.4120 3163.2144 3169.2256 3172.9687 3178.0070 3184.8243 3377.8211 3555.0235 3556.6832 3715.7461 3716.0700
redmass: 6.4247 6.2743 6.5896 4.0516 5.7580 7.8862 6.7109 5.7309 7.3993 6.3906 7.8923 6.4906 4.9679 6.0828 6.6862 6.5095 3.4308 4.6752 5.8585 5.2895 4.4048 5.2544 2.9746 8.6007 1.1990 1.2955 6.1697 3.1101 3.0227 4.0726 1.0449 1.0469 7.3033 4.2270 7.8779 7.0064 6.9471 6.9012 6.4566 4.4922 11.6135 1.3236 6.3216 4.6398 3.3102 1.3372 7.4081 5.9226 1.3187 5.1253 1.6799 1.4618 9.0347 4.9605 1.3812 2.4676 3.6841 1.3672 1.3402 1.3448 2.2742 2.1724 2.7368 1.3959 2.4516 1.6560 2.1411 1.2276 1.6551 2.9311 3.3821 5.9274 2.0821 1.6963 1.3774 6.6739 5.1597 7.2489 7.4688 6.2567 2.8962 2.9208 2.5385 4.8730 2.0359 2.3008 3.9763 3.0315 7.0829 5.6105 5.9775 1.4775 4.0198 2.5039 12.6342 1.0901 1.0863 1.0903 1.0885 1.0948 1.0942 1.0998 1.0962 1.0746 1.0440 1.0445 1.1058 1.1058
irintensity: 1.4613 0.2121 0.7459 0.8730 0.1087 5.1461 2.2666 3.1273 0.2924 7.8778 0.3474 2.9098 1.3182 1.3141 12.8605 0.3509 2.2876 1.1978 5.3165 10.8765 0.0462 21.4280 0.0004 0.5628 5.6446 445.8850 8.5095 113.5812 58.2957 0.5211 2.6182 5.0233 3.8543 2.5648 0.1132 7.2553 23.2067 6.6025 3.5202 0.0154 0.0012 72.8743 24.5105 0.0957 16.3570 67.0611 77.1507 1.0389 13.8732 22.3774 50.9936 0.3588 10.1206 0.3661 3.8378 1.2832 0.5654 0.2489 0.1851 0.0122 2.6605 4.9656 43.0596 11.5357 0.3098 69.5166 130.8459 50.6068 49.7228 14.4483 19.0475 10.4892 400.0980 146.6930 0.8935 769.0004 90.8758 249.0699 139.5153 29.8357 72.7956 7.1239 308.8661 798.4233 334.4676 108.8878 468.5026 86.2178 1.5745 3.5622 4.9345 663.2770 429.9543 140.4255 37.5501 13.2964 3.3642 7.6643 0.7494 10.8251 3.0441 21.9416 3.5728 13.6353 143.8694 119.4772 27.2089 68.0966
temp: 298.150 k
press: 1.00000 atm
elementType: 7 7 7 7 7 7 7 7 7 6 6 6 6 6 6 6 6 6 6 6 6 6 6 6 6 1 1 1 1 1 1 1 1 1 1 1 1 1
symmnumber: 1
zpe: 734262.0 jmol-1
zpe.correction: 0.279666 hartree
zpe.thermalcorrener: 0.300880 hartree
zpe.thermalcorrenthalpy: 0.301824 hartree
zpe.thermalcorrgfe: 0.226860 hartree
zpe.sumelectzpe: -1108.533549 hartree
zpe.sumelectthermal: -1108.512335 hartree
zpe.sumelectthermalent: -1108.511390 hartree
zpe.sumelectthermalfe: -1108.586355 hartree
dipole: -4.6557 4.0397 -0.0918
dipole: 6.1647
quadrupole: -118.2061 -126.3902 -150.8464
quadrupole: 30.6261 -0.5327 0.5012
quadrupole: 13.6082 5.4240 -19.0322 30.6261 -0.5327 0.5012
hfenergy: -1108.8132148 hartree
pointgroup: C01 [X(C16H13N9)]
dipole: 1.7632843 1.2760816 1.0699918 debye
polarizability: 628.4654225|-2.9488629|207.0972138|-0.297574|93.090813|164.9858886 unknown
InChI: InChI=1S/C16H13N9/c17-9-11-3-1-2-4-13(11)24-25-23-12-7-5-10(6-8-12)14-20-15(18)22-16(19)21-14/h1-8,23H,18-19H2
charge 0 multiplicity 1
38 atoms
N  -1.448468 -1.013449 -0.657291
N  5.015094 -0.808858 -0.471514
N  4.474162 1.063703 0.977905
N  -2.443089 -0.28673 -0.084901
N  6.814815 0.497893 0.54701
N  -3.623315 -0.741349 -0.452335
N  7.267718 -1.319068 -0.858552
N  6.225176 2.290642 1.933073
N  -6.302185 -2.518159 -1.967109
C  2.678706 -0.242198 -0.040466
C  -0.086084 -0.73234 -0.432457
C  2.249613 -1.310359 -0.871575
C  1.701187 0.57478 0.589993
C  0.881378 -1.557191 -1.068917
C  0.330107 0.340293 0.402239
C  4.123874 0.016333 0.165252
C  -4.724655 -0.039809 0.109829
C  6.341582 -0.518987 -0.242201
C  5.829742 1.25377 1.129103
C  -6.018605 -0.503337 -0.293504
C  -4.633878 1.053165 1.016836
C  -7.188141 0.126553 0.211437
C  -5.800063 1.666128 1.508294
C  -7.081173 1.206574 1.108622
C  -6.14575 -1.606242 -1.209463
H  3.010192 -1.932543 -1.351345
H  2.04786 1.393784 1.226699
H  0.558705 -2.384983 -1.712191
H  -0.421877 0.968264 0.885696
H  -1.731117 -1.792401 -1.27478
H  -3.643222 1.402318 1.321443
H  -8.168794 -0.240046 -0.106845
H  -5.718082 2.506296 2.206506
H  -7.984901 1.688121 1.495217
H  6.945677 -2.08034 -1.450202
H  8.257389 -1.136075 -0.715139
H  5.51598 2.867111 2.378043
H  7.217544 2.463036 2.070789
