program: Gaussian 09
title: 000287114
version: EM64L-G09RevD.01
frameworkgroup: C1[X(C16H13N9)]
method: RPBEPBE
basis: SDD
operation: Freq
keyword: #pfreq=noraman
keyword: PBEPBE/SDD
title: #p freq=noraman PBEPBE/SDD
converged: YES YES NO NO
title: Mulliken charges:
elementType: N N N N N N N N N C C C C C C C C C C C C C C C C H H H H H H H H H H H H H
charge: -0.332873 -0.023504 -0.105286 -0.332561 -0.125256 -0.126235 -0.116940 -0.582234 -0.582225 0.476876 0.219746 0.055002 0.032595 0.320604 -0.320969 -0.369821 -0.367351 -0.362577 -0.289448 -0.308927 0.028561 -0.252374 -0.208016 0.021025 0.020719 0.286489 0.266259 0.274030 0.275529 0.218376 0.265077 0.238010 0.241151 0.236191 0.333254 0.331819 0.331860 0.333425
chargesum: 0.00000
title: Mulliken charges with hydrogens summed into heavy atoms:
elementType: N N N N N N N N N C C C C C C C C C C C C C C C C
charge: -0.332873 -0.023504 -0.105286 -0.096369 -0.125256 -0.126235 -0.116940 0.082838 0.083060 0.476876 0.219746 0.055002 0.032595 0.320604 -0.034481 -0.103562 -0.093322 -0.087048 -0.071073 -0.043850 0.028561 -0.014363 0.033135 0.021025 0.020719
polarizability: 5.15420648e+02 -3.70082029e+00 2.43550991e+02 -1.18410914e+00 1.89997802e+00 1.06369145e+02
1716.lowfreq: -4.1005 -0.0006 -0.0006 0.0004 2.5585 5.4356 18.5903 22.4004 34.3088
frequency: 18.5620 22.3117 34.3033 57.2780 70.2607 94.5131 119.5220 163.7808 168.5971 183.3402 185.7934 214.1632 226.0203 297.4441 311.8808 339.2586 363.7751 385.5227 395.5973 408.2414 412.4159 461.5723 478.2242 479.4856 489.7293 501.0518 521.3388 537.5614 549.7113 550.1188 560.0768 566.1159 580.5174 588.8480 609.0325 634.1855 657.2436 677.7708 688.0479 715.1574 732.7347 735.7236 754.3144 777.8807 788.4758 808.2464 825.0642 838.9436 845.3705 865.6874 871.4235 883.2568 908.2000 961.2192 965.0016 984.8085 987.9583 989.9990 990.6664 999.4708 1006.1930 1020.9163 1028.8372 1100.0640 1118.6055 1128.2066 1134.4806 1163.4805 1172.6179 1190.7339 1193.7747 1221.3410 1251.2304 1280.3792 1298.1355 1301.6301 1366.8478 1377.2202 1390.1831 1405.0580 1410.5570 1425.6887 1441.3571 1466.1169 1473.5935 1498.0249 1515.2615 1516.2415 1558.7381 1579.4678 1594.4999 1596.6286 1612.0960 1615.4095 1627.5385 3128.4240 3146.3078 3162.0619 3164.8651 3168.0927 3177.6827 3186.1474 3211.8451 3379.9037 3554.9031 3556.5544 3716.0134 3716.3483
redmass: 6.4708 5.6217 6.4534 3.9542 5.8884 5.6118 5.9782 6.2965 7.7694 7.9531 5.8239 6.2582 7.0463 5.3506 2.9543 4.8060 5.7160 6.3441 4.2250 2.9727 3.4287 4.3077 1.1982 6.8859 1.3212 4.5356 3.7406 3.6003 1.1014 1.0498 7.4226 7.1322 6.9937 4.6695 6.3137 6.9305 4.6658 4.3794 6.5206 11.6707 1.9659 4.1033 4.6629 1.3498 2.2156 6.4054 5.5805 1.3553 3.1104 2.8156 3.3683 1.4545 9.4574 6.1735 1.3973 1.5527 2.0704 2.4910 1.6762 1.3412 3.7599 2.1828 2.2082 2.6436 1.3409 2.3993 1.9005 2.0099 1.1509 1.5729 2.2301 2.2967 5.9935 1.6887 3.9858 1.3698 4.8232 4.9642 7.3543 6.1680 7.4982 4.0720 2.5998 2.7003 4.9226 2.9732 2.3652 4.0393 6.7399 7.4674 6.4520 1.5200 5.6178 5.0613 2.3507 1.0875 1.0893 1.0944 1.0886 1.0905 1.0999 1.0960 1.0945 1.0760 1.0439 1.0444 1.1058 1.1058
irintensity: 2.7260 0.5992 1.2286 0.9034 0.3010 0.5208 1.0055 1.0937 0.7409 0.0069 11.1813 5.3513 3.0716 1.2370 3.7761 6.3521 2.6902 16.4148 1.2049 2.4720 1.8249 8.5088 0.0586 8.6430 526.6535 26.8053 1.6606 53.6332 2.1322 0.7990 10.8985 4.7576 31.1981 6.3257 3.9517 3.7169 14.0247 1.3282 21.7262 0.0044 27.6441 33.0808 1.0390 97.7761 24.2799 69.0540 24.3306 3.9899 87.3685 40.3119 9.8962 0.4104 10.3282 66.7975 3.3316 4.9489 2.5407 2.9010 1.8264 0.1600 203.3510 71.7804 12.9428 19.0078 23.0604 0.7929 36.5613 5.8756 1.4465 5.3532 9.3389 25.1416 9.3497 0.0168 27.8138 0.6281 65.0916 445.0925 71.1548 53.4073 37.3933 29.5897 26.9932 17.2900 761.5436 237.6245 125.1567 490.2268 54.1517 1.7435 22.7777 694.8613 76.4326 102.0246 238.9438 1.9566 6.5759 16.0322 1.0368 0.8567 22.3759 3.8328 0.2308 13.1965 142.3731 99.5984 27.8976 66.1578
temp: 298.150 k
press: 1.00000 atm
elementType: 7 7 7 7 7 7 7 7 7 6 6 6 6 6 6 6 6 6 6 6 6 6 6 6 6 1 1 1 1 1 1 1 1 1 1 1 1 1
symmnumber: 1
zpe: 736798.7 jmol-1
zpe.correction: 0.280632 hartree
zpe.thermalcorrener: 0.300561 hartree
zpe.thermalcorrenthalpy: 0.301506 hartree
zpe.thermalcorrgfe: 0.230418 hartree
zpe.sumelectzpe: -1108.537280 hartree
zpe.sumelectthermal: -1108.517351 hartree
zpe.sumelectthermalent: -1108.516407 hartree
zpe.sumelectthermalfe: -1108.587495 hartree
dipole: 1.3958 1.9173 0.7488
dipole: 2.4869
quadrupole: -75.3747 -127.2867 -149.4867
quadrupole: 9.9160 3.6513 -6.2207
quadrupole: 42.0080 -9.9040 -32.1040 9.9160 3.6513 -6.2207
hfenergy: -1108.8179123 hartree
pointgroup: C01 [X(C16H13N9)]
dipole: 0.5505762 -0.755501 -0.2888085 debye
polarizability: 515.3803874|3.3102509|243.546481|4.6749477|1.7265194|106.4139163 unknown
InChI: InChI=1S/C16H13N9/c17-13-11-3-1-2-4-12(11)23-24-25(13)10-7-5-9(6-8-10)14-20-15(18)22-16(19)21-14/h1-8,17H,18-19H2
charge 0 multiplicity 1
38 atoms
N  2.04045 0.168856 0.193033
N  2.46582 1.456515 0.664779
N  3.73387 1.741128 0.75411
N  2.421449 -2.006372 -0.670288
N  -4.339162 -1.209306 0.315855
N  -4.381779 1.146815 -0.267429
N  -6.48338 -0.080537 -0.020185
N  -6.370429 -2.350814 0.543951
N  -6.452522 2.193436 -0.58025
C  0.596577 0.081003 0.126747
C  4.366822 -0.519282 -0.077537
C  2.928924 -0.883001 -0.218501
C  4.717393 0.77681 0.396883
C  -2.239403 0.018689 0.069986
C  -0.090661 -1.125718 0.414129
C  -0.136701 1.255805 -0.18737
C  -1.496806 -1.148003 0.384382
C  -1.540835 1.220659 -0.215491
C  5.408914 -1.42325 -0.406166
C  6.075155 1.163319 0.537417
C  -3.723123 -0.016582 0.036899
C  6.757055 -1.041364 -0.269474
C  7.093925 0.255839 0.203196
C  -5.714718 -1.178241 0.271634
C  -5.75517 1.052166 -0.280102
H  0.472782 -2.033481 0.62701
H  0.400487 2.183522 -0.3969
H  -2.044153 -2.068749 0.60441
H  -2.120562 2.114546 -0.461697
H  5.172987 -2.430529 -0.767911
H  6.288386 2.170883 0.906974
H  7.550299 -1.750891 -0.527061
H  8.144654 0.544948 0.307013
H  3.148277 -2.68196 -0.969477
H  -5.824356 -3.180116 0.761702
H  -7.386527 -2.369867 0.521025
H  -7.468524 2.165803 -0.598609
H  -5.936919 3.04752 -0.775385
