program: Gaussian 09
title: 000287132
version: EM64L-G09RevD.01
frameworkgroup: C1[X(C23H19NO2)]
method: RPBEPBE
basis: SDD
operation: Freq
keyword: #p
keyword: freq=noraman
keyword: PBEPBE/SDD
title: #p freq=noraman PBEPBE/SDD
converged: YES YES NO NO
title: Mulliken charges:
elementType: O O N C C C C C C C C C C C C C C C C C C C C C C C H H H H H H H H H H H H H H H H H H H
charge: -0.246936 -0.273810 -0.059517 -0.102248 0.445009 0.425170 0.281792 -0.482740 0.067323 -0.409611 -0.369809 0.343137 -0.363370 -0.405409 -0.240444 -0.225895 -0.525155 -0.237047 -0.233831 -0.234988 -0.378324 -0.374548 -0.242432 -0.246199 -0.228368 -0.237453 0.263084 0.260768 0.252359 0.253027 0.246570 0.227675 0.226726 0.233647 0.251646 0.223674 0.229107 0.229003 0.228033 0.239640 0.273809 0.230606 0.227560 0.228589 0.230180
chargesum: 0.00000
title: Mulliken charges with hydrogens summed into heavy atoms:
elementType: O O N C C C C C C C C C C C C C C C C C C C C C C C
charge: -0.246936 -0.273810 -0.059517 -0.102248 0.445009 0.425170 0.281792 -0.219657 0.067323 -0.148843 -0.117450 0.343137 -0.110343 -0.158839 -0.012769 0.000831 0.183811 -0.007940 -0.004828 -0.006955 -0.138684 -0.100739 -0.011826 -0.018639 0.000221 -0.007273
polarizability: 3.90758516e+02 9.73578219e+00 2.44556854e+02 1.45800080e+01 5.79645401e+00 1.88235031e+02
1716.lowfreq: -4.9762 -0.0004 -0.0002 0.0003 3.3497 5.9540 21.7895 35.5359 42.7471
frequency: 21.6800 35.5071 42.7392 44.3315 58.9686 68.0738 79.9345 121.9736 127.6074 133.5163 148.4112 178.5262 192.0628 224.4469 232.2708 254.4584 274.0949 288.6509 314.4441 346.6146 363.5608 401.5894 405.2405 410.6989 426.0032 431.7765 476.2875 497.7990 516.1646 579.5482 603.5660 613.3886 614.6175 616.2765 620.6513 637.4207 656.3240 670.1419 687.5664 700.2204 702.0446 708.8432 751.0039 765.9279 778.1305 786.2981 827.0261 850.4755 855.3435 861.6080 875.1260 888.9145 900.7051 929.5350 933.7510 937.7234 975.5107 982.2579 984.2593 986.2347 989.3868 990.5212 991.5963 994.0837 995.6714 1001.0292 1001.3363 1025.9101 1028.3110 1034.1327 1067.8410 1072.6758 1084.5151 1089.0071 1091.8620 1119.4167 1152.6373 1172.5584 1173.4027 1173.5371 1186.7638 1191.7121 1193.8855 1225.6810 1247.0970 1307.6622 1314.7786 1316.8996 1331.7230 1360.5891 1378.8112 1380.1658 1382.3486 1422.8866 1426.1663 1435.6845 1436.2298 1455.9673 1474.0751 1479.2014 1479.8894 1482.5637 1490.1318 1579.1834 1585.9438 1593.4620 1609.5676 1611.6026 1612.3585 1616.6621 2984.4582 3085.1947 3121.2863 3124.5071 3124.9304 3126.0768 3132.1558 3134.8588 3134.9219 3144.8651 3147.0192 3148.1615 3154.5739 3156.8806 3158.1752 3160.1430 3168.3116 3169.3892 3171.0569
redmass: 5.2089 3.9594 4.8618 3.9443 4.7468 4.3413 4.2192 4.4042 3.6735 1.1907 3.8945 4.5277 4.0648 5.3639 5.6028 4.9724 5.0165 5.7419 4.5151 6.2450 6.3998 2.8637 2.8468 2.9223 4.7291 7.0851 4.4768 4.1438 3.9270 5.7244 6.0458 6.4314 6.3356 6.7553 6.1686 5.4896 3.9964 6.6987 6.0647 1.7596 1.7125 1.8779 2.7262 1.8711 1.8976 3.5909 6.1181 1.2549 1.2538 1.2557 6.5973 1.6041 4.3751 1.5660 1.4788 1.4306 1.4708 1.5669 4.4120 1.9157 5.3471 2.7302 5.8360 4.8782 1.3992 1.3306 1.3368 2.4426 2.3938 2.0423 2.6126 2.3976 1.6070 1.7128 1.8212 1.3073 1.4566 1.0527 1.0541 1.0529 1.1141 1.1215 1.1195 4.2796 2.1455 1.6181 1.3647 1.4160 2.4032 2.5901 6.1857 5.7903 9.1393 2.8077 1.1813 2.0852 2.2918 1.0519 3.2741 1.6865 1.4962 2.2923 2.5348 5.7756 6.2417 6.3219 6.0007 6.2066 6.1469 7.5578 1.0298 1.1034 1.1040 1.0849 1.0848 1.0847 1.0880 1.0883 1.0882 1.0934 1.0934 1.0927 1.0914 1.0960 1.0960 1.0964 1.1005 1.1001 1.0997
irintensity: 0.3137 0.2391 0.2529 0.0621 0.1571 0.9698 0.2630 0.3168 1.2743 0.3732 1.4289 3.1677 12.2716 1.4723 0.3457 2.2969 1.5168 1.7055 2.1703 7.2096 4.5472 0.0386 1.2290 0.1525 1.1979 0.9239 1.8076 2.2417 19.6373 38.3197 20.0002 2.1202 1.9973 1.2327 2.1597 9.0242 18.0298 0.1499 14.4420 52.3814 59.9857 34.2820 41.3231 47.1077 39.7635 159.2591 6.9592 0.9295 0.2027 0.2018 11.9450 17.9745 24.3347 8.4545 1.1262 6.4186 2.5965 6.1865 85.1872 2.0782 1.2835 2.4444 1.2685 55.2511 6.9284 2.0255 5.1039 8.9843 12.1049 4.8631 16.7440 23.0678 11.1570 1.6404 7.6355 6.9169 1.7096 0.1009 0.1749 0.1462 6.8137 8.3434 1.5783 39.8423 18.3329 6.2888 5.9242 3.4381 4.1375 56.9086 3.9479 22.8010 2.3443 5.0712 4.4026 23.3959 4.4253 5.5899 19.0590 6.2773 7.4089 17.5948 4.9931 6.7289 2.8464 0.5941 0.0485 4.7859 2.0075 37.5773 50.5639 32.6546 17.8033 2.1644 0.7138 2.8921 2.2711 6.8448 6.4270 20.9703 34.5481 23.5065 4.0807 17.7241 37.2470 25.1650 12.1837 22.8292 16.0326
temp: 298.150 k
press: 1.00000 atm
elementType: 8 8 7 6 6 6 6 6 6 6 6 6 6 6 6 6 6 6 6 6 6 6 6 6 6 6 1 1 1 1 1 1 1 1 1 1 1 1 1 1 1 1 1 1 1
symmnumber: 1
zpe: 925933.3 jmol-1
zpe.correction: 0.352669 hartree
zpe.thermalcorrener: 0.374583 hartree
zpe.thermalcorrenthalpy: 0.375527 hartree
zpe.thermalcorrgfe: 0.300293 hartree
zpe.sumelectzpe: -1091.173512 hartree
zpe.sumelectthermal: -1091.151598 hartree
zpe.sumelectthermalent: -1091.150654 hartree
zpe.sumelectthermalfe: -1091.225889 hartree
dipole: 1.2810 1.9254 0.2088
dipole: 2.3220
quadrupole: -128.0552 -144.3754 -144.6130
quadrupole: -3.6489 3.2242 -3.5103
quadrupole: 10.9593 -5.3609 -5.5985 -3.6489 3.2242 -3.5103
hfenergy: -1091.5261814 hartree
pointgroup: C01 [X(C23H19N1O2)]
dipole: -0.4950583 -0.7677328 -0.0089746 debye
polarizability: 389.1414876|13.6460208|245.3585552|-20.7821257|1.7950398|189.0503579 unknown
InChI: InChI=1S/C23H19NO2/c1-25-23(20-15-9-4-10-16-20)21(18-11-5-2-6-12-18)17-22(24-26-23)19-13-7-3-8-14-19/h2-17H,1H3
charge 0 multiplicity 1
45 atoms
O  0.181439 1.903232 -0.04837
O  -0.486273 0.792572 2.008734
N  1.614233 1.700344 -0.114003
C  -0.698628 0.827934 0.570024
C  -0.262989 -0.543314 0.045886
C  -2.103134 1.287334 0.162797
C  -1.221702 -1.665798 -0.096276
C  1.071349 -0.688679 -0.243459
C  2.012795 0.422774 -0.174117
C  -3.160612 1.316413 1.102093
C  -2.35493 1.669676 -1.177551
C  3.484544 0.205664 -0.25825
C  -2.196094 -1.930976 0.905413
C  -1.151403 -2.531696 -1.223765
C  -4.453974 1.724332 0.709021
C  -3.648848 2.073132 -1.571742
C  -0.404407 2.113788 2.676072
C  -4.703527 2.102015 -0.629889
C  -3.067795 -3.032634 0.784326
C  -2.027775 -3.630443 -1.345698
C  4.052897 -1.046353 0.100949
C  4.347202 1.251954 -0.6879
C  -2.990719 -3.88576 -0.34148
C  5.448344 -1.24924 0.02647
C  5.739064 1.047118 -0.759592
C  6.297299 -0.205444 -0.405863
H  1.450235 -1.662471 -0.567014
H  -2.968581 1.014637 2.137137
H  -1.53375 1.666513 -1.901084
H  -2.233671 -1.295602 1.795512
H  -0.426182 -2.321047 -2.018292
H  -5.264862 1.74329 1.445714
H  -3.833411 2.368472 -2.610608
H  -1.23936 2.775999 2.383416
H  0.55351 2.600733 2.426214
H  -0.453181 1.887265 3.752433
H  -5.707573 2.416386 -0.936228
H  -3.804245 -3.229768 1.571195
H  -1.967424 -4.279737 -2.226289
H  3.412069 -1.856398 0.466177
H  3.907753 2.216308 -0.960129
H  -3.673458 -4.737417 -0.436633
H  5.871962 -2.218473 0.312104
H  6.390802 1.861184 -1.09584
H  7.379813 -0.364023 -0.465214
